program: Orca
programVersion: 5.0.2
elementType: O O O O O O O O O N N C C C C C C C C C C C C C C C C C C C C C C H H H H H H H H H H H H H H H H H H H H H H H
charge: -1
multiplicity: 1
keywords: wb97x-d3
keywords: def2-TZVPP
keywords: def2/J RIJCOSX
keywords: DEFGRID2
keywords: scfconv7
keywords: smallprint printgap noloewdin
keywords: NOSOSCF
formula: C22H23N2O9
InChI: InChI=1/C22H23N2O9/c1-21(32)7-5-4-6-8(25)9(7)15(26)10-12(21)17(28)13-14(24(2)3)16(27)11(20(23)31)19(30)22(13,33)18(10)29/h4-6,12-14,17,25,28,30,32-33H,23H2,1-3H3
56 atoms
O  -0.337084 2.586843 1.940577
O  1.212031 2.561793 -0.468942
O  -2.279879 -1.040013 1.336125
O  1.105961 -0.172156 -2.215036
O  3.444835 1.601176 -1.503826
O  -1.428889 -0.910937 -2.824361
O  3.428118 -1.917936 1.594367
O  -3.73633 -0.949561 -3.64215
O  5.455007 0.28788 -1.299088
N  0.959819 -1.14244 2.632123
N  5.616636 -1.445589 0.111362
C  1.137243 0.831598 1.138555
C  -1.338999 0.999172 0.36365
C  -0.290615 1.248062 1.48609
C  1.448302 1.184612 -0.303198
C  1.416138 -0.66906 1.348991
C  -2.586916 0.29327 0.947504
C  -0.816294 0.27851 -0.869643
C  0.548366 0.3483 -1.239884
C  2.885505 0.848729 -0.617865
C  -3.627723 0.131134 -0.151185
C  2.877218 -0.986556 1.018857
C  -1.73747 -0.335454 -1.742755
C  3.549638 -0.191849 0.007449
C  -3.150154 1.068221 2.137802
C  -3.181938 -0.249913 -1.421299
C  -4.987728 0.261368 0.088302
C  0.648825 -2.551437 2.722216
C  1.643658 -0.641628 3.801212
C  -4.12048 -0.536693 -2.435599
C  4.933426 -0.443954 -0.422253
C  -5.903356 0.016664 -0.930419
C  -5.483945 -0.385176 -2.181483
H  1.808275 1.404032 1.790044
H  -1.690113 1.996901 0.063176
H  -0.546499 0.661774 2.368755
H  0.833936 -1.226983 0.603651
H  -4.005244 0.551637 2.573426
H  -3.468909 2.072018 1.854703
H  -2.419227 1.169351 2.939739
H  -0.066892 3.151427 1.207045
H  1.123683 2.7750 -1.4057
H  -1.608296 -1.016527 2.029539
H  -5.360448 0.552756 1.059273
H  0.116153 -2.877641 1.827313
H  1.519264 -3.205406 2.850326
H  -0.012813 -2.723972 3.574968
H  1.815995 0.432103 3.725493
H  1.01822 -0.799869 4.682804
H  2.61044 -1.121601 3.999786
H  4.405203 1.226394 -1.613958
H  -6.962412 0.13042 -0.734475
H  -6.197243 -0.593168 -2.969654
H  5.187871 -2.031914 0.812801
H  6.560874 -1.623322 -0.193058
H  -2.730062 -1.045993 -3.564219
elementType: O N C H
totalener: -1639.09231900 hartree
nucrepener: 3789.41679273 hartree
electener: -5428.50911173 hartree
oneelecener: -9810.78846212 hartree
twoeener: 4382.27935040 hartree
cpcmener: -0.11946903 hartree
kineticenergy: 1632.36792387 hartree
xcener: -152.461434888365 hartree
chargesum: -1.0000000
charge: -0.450571 -0.410981 -0.437067 -0.505772 -0.349400 -0.533257 -0.498509 -0.428131 -0.506139 -0.234052 -0.241174 0.218209 0.077504 -0.010287 0.626191 -0.076289 0.516291 -0.346135 0.032620 0.150654 -0.093709 0.243606 0.149157 -0.248690 -0.410978 -0.164138 -0.196826 -0.205961 -0.212642 0.240323 0.326071 -0.122166 -0.237149 0.098659 0.083366 0.074994 0.142399 0.102294 0.112701 0.106466 0.221444 0.228190 0.227913 0.143004 0.098386 0.090167 0.105820 0.104075 0.106417 0.088840 0.265372 0.150309 0.130000 0.215948 0.182981 0.259650
qa: -0.4506 -0.4110 -0.4371 -0.5058 -0.3494 -0.5333 -0.4985 -0.4281 -0.5061 -0.2341 -0.2412 0.2182 0.0775 -0.0103 0.6262 -0.0763 0.5163 -0.3461 0.0326 0.1507 -0.0937 0.2436 0.1492 -0.2487 -0.4110 -0.1641 -0.1968 -0.2060 -0.2126 0.2403 0.3261 -0.1222 -0.2371 0.0987 0.0834 0.0750 0.1424 0.1023 0.1127 0.1065 0.2214 0.2282 0.2279 0.1430 0.0984 0.0902 0.1058 0.1041 0.1064 0.0888 0.2654 0.1503 0.1300 0.2159 0.1830 0.2597
va: 1.9666 2.0448 2.0131 1.9990 2.2106 1.9661 2.0000 2.0699 2.0147 2.8073 3.2760 3.5180 3.6507 4.0883 3.5200 4.0429 3.7801 3.1395 4.3865 3.9632 3.6959 4.0092 4.2651 3.4312 3.9950 3.5186 3.8918 3.9046 3.9235 3.9476 4.2845 3.9457 3.9946 1.0361 1.0328 1.0453 0.9831 1.0074 1.0042 1.0021 1.0320 1.0115 1.0230 1.0035 1.0024 1.0111 0.9893 0.9996 0.9934 1.0082 1.0857 0.9920 1.0146 1.0326 1.0124 1.0768
dispersion: -0.038120279 hartree
energy: -1639.130439280860 hartree
dipole: -7.43039 8.37738 0.94700 -2.02066 3.15239 1.13173 26.36498 -21.77311 4.59187
magnitude: 4.82316 au
magnitude: 12.25950 debye
