program: Orca
programVersion: 5.0.2
elementType: O O O O O O O O O N N C C C C C C C C C C C C C C C C C C C C C C H H H H H H H H H H H H H H H H H H H H H H H
charge: -1
multiplicity: 1
keywords: wb97x-d3
keywords: def2-TZVPP
keywords: def2/J RIJCOSX
keywords: DEFGRID2
keywords: scfconv7
keywords: smallprint printgap noloewdin
keywords: NOSOSCF
formula: C22H23N2O9
InChI: InChI=1/C22H23N2O9/c1-21(32)7-5-4-6-8(25)9(7)15(26)10-12(21)17(28)13-14(24(2)3)16(27)11(20(23)31)19(30)22(13,33)18(10)29/h4-6,12-14,17,25,28,30,32-33H,23H2,1-3H3
56 atoms
O  -0.519526 1.686001 2.593456
O  1.423527 2.680292 0.16387
O  -3.049827 1.94216 1.710294
O  1.191674 0.511242 -2.347973
O  3.551409 1.82421 -1.113149
O  -1.360578 -0.505762 -2.890672
O  3.273085 -2.206582 1.249823
O  -3.195776 -2.1486 -2.726811
O  5.520457 0.435393 -1.054459
N  0.667682 -1.72342 2.039086
N  5.572021 -1.514293 0.047481
C  0.982465 0.563456 1.13565
C  -1.218517 1.52088 0.242892
C  -0.501653 0.865864 1.438105
C  1.481061 1.301668 -0.109997
C  1.269282 -0.945206 0.988489
C  -2.751124 1.584328 0.370701
C  -0.784206 0.864597 -1.047022
C  0.60664 0.879477 -1.325584
C  2.916952 0.93333 -0.425357
C  -3.399164 0.268348 0.002126
C  2.763773 -1.193371 0.785479
C  -1.644255 0.025094 -1.779163
C  3.518987 -0.232982 0.005159
C  -3.295836 2.663925 -0.568951
C  -2.915676 -0.389144 -1.132789
C  -4.507076 -0.220612 0.676096
C  1.142273 -1.520072 3.386037
C  0.380576 -3.104474 1.737571
C  -3.598687 -1.520985 -1.622367
C  4.932182 -0.427509 -0.358104
C  -5.150244 -1.361062 0.204684
C  -4.715726 -2.004138 -0.937726
H  1.569808 0.939565 1.980944
H  -0.904173 2.567729 0.226113
H  -0.995671 -0.090503 1.647805
H  0.798802 -1.281383 0.053885
H  -4.384181 2.731145 -0.492001
H  -3.055173 2.457536 -1.61079
H  -2.872339 3.637472 -0.312572
H  -1.441314 1.942516 2.727527
H  1.492036 3.180215 -0.657881
H  -3.914894 2.364635 1.749608
H  -4.885517 0.273502 1.560593
H  1.242018 -0.458677 3.613252
H  0.408029 -1.921212 4.089005
H  2.102315 -2.001645 3.612932
H  -0.401428 -3.470552 2.408574
H  -0.003227 -3.194084 0.719929
H  1.234462 -3.786183 1.834342
H  4.504183 1.442821 -1.249336
H  -6.013965 -1.744894 0.733697
H  -5.229399 -2.88163 -1.311303
H  5.094881 -2.198347 0.616991
H  6.539599 -1.645615 -0.202439
H  -2.39686 -1.61501 -3.043499
elementType: O N C H
totalener: -1639.09275906 hartree
nucrepener: 3803.26473498 hartree
electener: -5442.35749404 hartree
oneelecener: -9839.53509737 hartree
twoeener: 4397.17760333 hartree
cpcmener: -0.12028311 hartree
kineticenergy: 1632.35462997 hartree
xcener: -152.457529062221 hartree
chargesum: -1.0000000
charge: -0.446302 -0.389934 -0.410695 -0.493144 -0.354952 -0.540927 -0.500175 -0.425467 -0.505284 -0.215671 -0.240846 0.207769 0.291641 -0.218494 0.573846 -0.033934 0.547252 -0.375004 -0.008372 0.118096 -0.148977 0.262450 0.130816 -0.217635 -0.335054 -0.107232 -0.256848 -0.204699 -0.195139 0.262947 0.324959 -0.117365 -0.243957 0.078399 0.074679 0.112277 0.131333 0.109244 0.105874 0.105037 0.227804 0.220704 0.212169 0.126925 0.094172 0.102192 0.084748 0.097418 0.095474 0.083398 0.263470 0.151527 0.131043 0.215894 0.182760 0.259789
qa: -0.4463 -0.3899 -0.4107 -0.4931 -0.3550 -0.5409 -0.5002 -0.4255 -0.5053 -0.2157 -0.2408 0.2078 0.2916 -0.2185 0.5738 -0.0339 0.5473 -0.3750 -0.0084 0.1181 -0.1490 0.2624 0.1308 -0.2176 -0.3351 -0.1072 -0.2568 -0.2047 -0.1951 0.2629 0.3250 -0.1174 -0.2440 0.0784 0.0747 0.1123 0.1313 0.1092 0.1059 0.1050 0.2278 0.2207 0.2122 0.1269 0.0942 0.1022 0.0847 0.0974 0.0955 0.0834 0.2635 0.1515 0.1310 0.2159 0.1828 0.2598
va: 1.9811 2.0777 2.0166 2.0104 2.1988 1.9651 1.9966 2.0741 2.0151 2.8582 3.2751 3.2918 3.2233 4.2061 3.5933 4.0370 3.5847 3.4269 4.5213 4.0289 3.7162 3.9925 4.2484 3.4191 3.9294 3.4005 3.9955 3.9257 3.9341 3.9189 4.2804 3.9282 4.0027 1.0545 1.0711 1.0371 0.9834 1.0021 0.9974 1.0069 1.0517 1.0167 1.0179 1.0315 1.0109 0.9922 1.0065 0.9921 0.9986 1.0042 1.0881 0.9916 1.0134 1.0327 1.0125 1.0743
dispersion: -0.037385614 hartree
energy: -1639.130144676087 hartree
dipole: -11.19084 10.06594 -1.12490 -4.41181 4.91232 0.50051 17.60700 -13.98452 3.62248
magnitude: 3.82600 au
magnitude: 9.72491 debye
