program: Orca
programVersion: 5.0.2
elementType: O O O O O O O O O N N C C C C C C C C C C C C C C C C C C C C C C H H H H H H H H H H H H H H H H H H H H H H H
charge: -1
multiplicity: 1
keywords: wb97x-d3
keywords: def2-TZVPP
keywords: def2/J RIJCOSX
keywords: DEFGRID2
keywords: scfconv7
keywords: smallprint printgap noloewdin
keywords: NOSOSCF
formula: C22H23N2O9
InChI: InChI=1/C22H23N2O9/c1-21(32)7-5-4-6-8(25)9(7)15(26)10-12(21)17(28)13-14(24(2)3)16(27)11(20(23)31)19(30)22(13,33)18(10)29/h4-6,12-14,17,25,28,30,32-33H,23H2,1-3H3
56 atoms
O  -0.543416 2.320343 2.200603
O  1.012444 2.539304 -0.28947
O  -2.240788 -1.297915 1.322204
O  1.104632 -0.169922 -2.103858
O  3.365422 1.836799 -1.244847
O  -1.439477 -0.696038 -2.914912
O  3.284765 -2.175636 1.16484
O  -3.742204 -0.684954 -3.745399
O  5.414453 0.564127 -1.156378
N  1.364209 -1.035594 2.885495
N  5.551251 -1.405321 -0.09171
C  1.073144 0.765841 1.259407
C  -1.415566 0.832547 0.470474
C  -0.390913 1.038482 1.620056
C  1.355346 1.181488 -0.169594
C  1.453834 -0.703627 1.478253
C  -2.633721 0.023894 0.976846
C  -0.859769 0.209431 -0.802961
C  0.514997 0.318323 -1.134499
C  2.812671 0.958379 -0.479509
C  -3.671277 -0.057766 -0.141924
C  2.808505 -1.083886 0.869461
C  -1.766711 -0.279322 -1.768063
C  3.492993 -0.141046 0.011338
C  -3.233134 0.628221 2.239653
C  -3.21445 -0.258771 -1.450459
C  -5.036052 -0.02864 0.107524
C  0.879903 -2.356368 3.206748
C  2.478127 -0.633825 3.713284
C  -4.142333 -0.452846 -2.497123
C  4.878451 -0.319611 -0.443136
C  -5.942246 -0.186107 -0.936131
C  -5.510413 -0.399293 -2.229043
H  1.69247 1.378804 1.924943
H  -1.808903 1.830381 0.228972
H  -0.614922 0.341597 2.427863
H  0.717075 -1.324461 0.95301
H  -3.60837 1.634755 2.057093
H  -2.507439 0.682328 3.048799
H  -4.059728 0.022744 2.611212
H  -0.341346 2.974412 1.521922
H  0.954588 2.787863 -1.219867
H  -1.725487 -1.660257 0.589738
H  -5.419472 0.122615 1.105797
H  0.560188 -2.381419 4.25166
H  0.006878 -2.595481 2.59891
H  1.616025 -3.159255 3.07274
H  3.341203 -1.311664 3.669669
H  2.828713 0.363522 3.442735
H  2.159349 -0.585476 4.757034
H  4.342715 1.510778 -1.369062
H  -7.004754 -0.149808 -0.729466
H  -6.216864 -0.535385 -3.038801
H  5.098413 -2.126836 0.450822
H  6.500758 -1.528838 -0.406527
H  -2.732704 -0.759205 -3.673195
elementType: O N C H
totalener: -1639.09424253 hartree
nucrepener: 3780.26863309 hartree
electener: -5419.36287562 hartree
oneelecener: -9792.14777351 hartree
twoeener: 4372.78489789 hartree
cpcmener: -0.11457690 hartree
kineticenergy: 1632.36224237 hartree
xcener: -152.456734328681 hartree
chargesum: -1.0000000
charge: -0.450045 -0.399743 -0.433578 -0.497747 -0.348458 -0.532480 -0.496826 -0.426980 -0.506765 -0.232683 -0.240010 0.193875 0.074228 0.018779 0.656723 -0.048359 0.628789 -0.424500 0.030569 0.149463 -0.193780 0.237365 0.182058 -0.255870 -0.410818 -0.121120 -0.234073 -0.188994 -0.210746 0.232253 0.335000 -0.111679 -0.247403 0.083857 0.081315 0.072090 0.124477 0.113877 0.102981 0.102045 0.219774 0.223715 0.233313 0.144495 0.099007 0.088992 0.083156 0.082803 0.104109 0.105975 0.266791 0.151040 0.130262 0.216003 0.184011 0.259468
qa: -0.4500 -0.3997 -0.4336 -0.4977 -0.3485 -0.5325 -0.4968 -0.4270 -0.5068 -0.2327 -0.2400 0.1939 0.0742 0.0188 0.6567 -0.0484 0.6288 -0.4245 0.0306 0.1495 -0.1938 0.2374 0.1821 -0.2559 -0.4108 -0.1211 -0.2341 -0.1890 -0.2107 0.2323 0.3350 -0.1117 -0.2474 0.0839 0.0813 0.0721 0.1245 0.1139 0.1030 0.1020 0.2198 0.2237 0.2333 0.1445 0.0990 0.0890 0.0832 0.0828 0.1041 0.1060 0.2668 0.1510 0.1303 0.2160 0.1840 0.2595
va: 1.9646 2.0615 2.0024 2.0044 2.2159 1.9667 2.0052 2.0717 2.0155 2.8746 3.2753 3.6678 3.6544 3.9964 3.4926 3.9875 3.5564 3.1961 4.3696 3.9492 3.8542 3.9652 4.1941 3.3853 3.9881 3.4688 3.9265 3.9263 3.9360 3.9724 4.2822 3.9400 3.9982 1.0611 1.0340 1.0738 1.0100 1.0024 1.0103 1.0092 1.0280 1.0145 1.0105 1.0035 0.9908 1.0105 1.0075 1.0045 0.9942 0.9952 1.0843 0.9916 1.0149 1.0315 1.0119 1.0774
dispersion: -0.037931496 hartree
energy: -1639.132174026919 hartree
dipole: -5.56703 6.42822 0.86118 -3.49805 4.18134 0.68328 26.14928 -22.52479 3.62449
magnitude: 3.78754 au
magnitude: 9.62715 debye
