program: Orca
programVersion: 5.0.2
elementType: O O O O O O O O O N N C C C C C C C C C C C C C C C C C C C C C C H H H H H H H H H H H H H H H H H H H H H H H
charge: -1
multiplicity: 1
keywords: wb97x-d3
keywords: def2-TZVPP
keywords: def2/J RIJCOSX
keywords: DEFGRID2
keywords: scfconv7
keywords: smallprint printgap noloewdin
keywords: NOSOSCF
formula: C22H23N2O9
InChI: InChI=1/C22H23N2O9/c1-21(32)7-5-4-6-8(25)9(7)15(26)10-12(21)17(28)13-14(24(2)3)16(27)11(20(23)31)19(30)22(13,33)18(10)29/h4-6,12-14,17,25,28,30,32-33H,23H2,1-3H3
56 atoms
O  -0.519904 1.87004 2.541802
O  1.396899 2.763713 0.128552
O  -3.118268 2.013056 1.647373
O  1.195336 0.769713 -2.371797
O  3.590075 1.870347 -0.930531
O  -1.282849 -0.49061 -2.868243
O  2.942171 -2.375322 0.946241
O  -2.974498 -2.276746 -2.602181
O  5.461489 0.339968 -0.954451
N  0.399138 -1.74161 1.832615
N  5.319243 -1.729002 -0.10631
C  0.890778 0.586918 1.122442
C  -1.267555 1.606285 0.218878
C  -0.562269 0.980713 1.43774
C  1.447738 1.375879 -0.069416
C  1.061753 -0.922845 0.852776
C  -2.799497 1.61479 0.324646
C  -0.796345 0.969666 -1.065454
C  0.596676 1.045574 -1.332517
C  2.87443 0.960142 -0.359711
C  -3.36599 0.248814 0.006295
C  2.531701 -1.268275 0.616592
C  -1.597823 0.057266 -1.772551
C  3.378555 -0.285567 -0.032729
C  -3.384969 2.629869 -0.660438
C  -2.834943 -0.421122 -1.100565
C  -4.429658 -0.293245 0.709622
C  0.906915 -1.720408 3.181893
C  -0.032199 -3.047108 1.396048
C  -3.425211 -1.626831 -1.528931
C  4.783412 -0.549794 -0.387221
C  -4.980352 -1.503265 0.297997
C  -4.497146 -2.164837 -0.813748
H  1.498221 0.844833 1.999329
H  -0.982316 2.66222 0.202142
H  -1.091958 0.062291 1.71549
H  0.570247 -1.145055 -0.103918
H  -3.011324 3.631622 -0.437773
H  -4.475927 2.647543 -0.594085
H  -3.125395 2.397293 -1.69201
H  -1.428883 2.156642 2.694344
H  1.696962 2.969233 1.022385
H  -4.022427 2.34494 1.677022
H  -4.841624 0.209247 1.574302
H  1.110614 -0.699631 3.507604
H  0.146286 -2.11762 3.85844
H  1.819198 -2.310135 3.340004
H  0.752309 -3.813839 1.386487
H  -0.829423 -3.408009 2.051556
H  -0.449539 -2.985295 0.389226
H  4.516406 1.444214 -1.075716
H  -5.807873 -1.92986 0.851451
H  -4.937636 -3.099312 -1.139419
H  4.764271 -2.437677 0.352465
H  6.278638 -1.912812 -0.354316
H  -2.224536 -1.698407 -2.953304
elementType: O N C H
totalener: -1639.09087741 hartree
nucrepener: 3833.66065743 hartree
electener: -5472.75153483 hartree
oneelecener: -9900.27035897 hartree
twoeener: 4427.51882413 hartree
cpcmener: -0.12425578 hartree
kineticenergy: 1632.36687464 hartree
xcener: -152.459492599351 hartree
chargesum: -1.0000000
charge: -0.441516 -0.409303 -0.412149 -0.483153 -0.334662 -0.547027 -0.500139 -0.426265 -0.507994 -0.220441 -0.242049 0.181409 0.286718 -0.213513 0.619998 -0.053515 0.524211 -0.340453 0.000902 0.102314 -0.130951 0.264899 0.109226 -0.236250 -0.335297 -0.122011 -0.251752 -0.207766 -0.190851 0.258919 0.322118 -0.119021 -0.239337 0.101262 0.082423 0.118032 0.133991 0.104765 0.108326 0.106084 0.228765 0.212950 0.208636 0.124989 0.097995 0.102521 0.085790 0.084248 0.098272 0.092825 0.263884 0.151182 0.130529 0.215717 0.181894 0.259620
qa: -0.4415 -0.4093 -0.4121 -0.4832 -0.3347 -0.5470 -0.5001 -0.4263 -0.5080 -0.2204 -0.2420 0.1814 0.2867 -0.2135 0.6200 -0.0535 0.5242 -0.3405 0.0009 0.1023 -0.1310 0.2649 0.1092 -0.2362 -0.3353 -0.1220 -0.2518 -0.2078 -0.1909 0.2589 0.3221 -0.1190 -0.2393 0.1013 0.0824 0.1180 0.1340 0.1048 0.1083 0.1061 0.2288 0.2129 0.2086 0.1250 0.0980 0.1025 0.0858 0.0842 0.0983 0.0928 0.2639 0.1512 0.1305 0.2157 0.1819 0.2596
va: 1.9867 2.0363 2.0175 2.0117 2.2166 1.9574 1.9981 2.0702 2.0118 2.8490 3.2708 3.4946 3.2122 4.1931 3.5420 4.0505 3.6522 3.3963 4.3570 4.0960 3.6945 3.9784 4.2570 3.4226 3.9342 3.4099 3.9887 3.9259 3.9347 3.9017 4.2868 3.9283 4.0029 1.0305 1.0639 1.0403 0.9784 1.0067 1.0023 0.9976 1.0434 1.0248 1.0209 1.0315 1.0054 0.9928 1.0067 1.0050 0.9921 0.9970 1.0837 0.9918 1.0137 1.0338 1.0130 1.0737
dispersion: -0.038591842 hartree
energy: -1639.129469247628 hartree
dipole: -12.44884 11.23333 -1.21550 -5.57554 5.53877 -0.03677 17.85615 -12.99837 4.85778
magnitude: 5.00768 au
magnitude: 12.72851 debye
