program: Orca
programVersion: 5.0.2
elementType: O O O O O O O O O N N C C C C C C C C C C C C C C C C C C C C C C H H H H H H H H H H H H H H H H H H H H H H H
charge: -1
multiplicity: 1
keywords: wb97x-d3
keywords: def2-TZVPP
keywords: def2/J RIJCOSX
keywords: DEFGRID2
keywords: scfconv7
keywords: smallprint printgap noloewdin
keywords: NOSOSCF
formula: C22H23N2O9
InChI: InChI=1/C22H23N2O9/c1-21(32)7-5-4-6-8(25)9(7)15(26)10-12(21)17(28)13-14(24(2)3)16(27)11(20(23)31)19(30)22(13,33)18(10)29/h4-6,12-14,17,25,28,30,32-33H,23H2,1-3H3
56 atoms
O  -0.438428 1.760283 2.565413
O  1.499621 2.686343 0.280525
O  -3.11078 1.996208 1.661816
O  1.235161 0.707287 -2.381467
O  3.632045 1.825257 -1.014726
O  -1.2323 -0.557948 -2.814143
O  3.141322 -2.332603 1.07665
O  -2.899637 -2.351631 -2.474729
O  5.529479 0.367921 -1.007469
N  0.572637 -1.940563 1.703002
N  5.490859 -1.655088 -0.044609
C  0.973237 0.515744 1.100933
C  -1.186894 1.582011 0.234129
C  -0.481319 0.913772 1.428175
C  1.521885 1.325508 -0.079648
C  1.174861 -0.992556 0.805229
C  -2.721501 1.616543 0.349918
C  -0.734812 0.945403 -1.053955
C  0.653704 1.003351 -1.331073
C  2.946589 0.922248 -0.392903
C  -3.302495 0.255774 0.058464
C  2.674561 -1.280155 0.660735
C  -1.543675 0.016935 -1.726435
C  3.486245 -0.296191 -0.031104
C  -3.30152 2.622008 -0.648842
C  -2.772509 -0.444114 -1.03285
C  -4.371442 -0.263516 0.77067
C  -0.716974 -2.485001 1.344773
C  0.720485 -1.676168 3.113587
C  -3.358153 -1.665057 -1.419395
C  4.896042 -0.523328 -0.380986
C  -4.916916 -1.488227 0.396594
C  -4.426245 -2.186476 -0.68904
H  1.578647 0.760709 1.98132
H  -0.883676 2.632643 0.230677
H  -1.03683 0.004447 1.673205
H  0.761755 -1.207844 -0.187547
H  -3.054373 2.368284 -1.678118
H  -2.904881 3.621549 -0.451154
H  -4.388643 2.66089 -0.564944
H  -1.356368 1.986969 2.759505
H  1.663563 3.232493 -0.497365
H  -3.079636 2.959079 1.715337
H  -4.79434 0.27131 1.608341
H  -1.581006 -1.862191 1.613308
H  -0.763916 -2.670172 0.271269
H  -0.857455 -3.44718 1.84386
H  0.540559 -2.592677 3.679703
H  1.735268 -1.352506 3.346668
H  0.032984 -0.916061 3.508712
H  4.577238 1.398684 -1.151807
H  -5.747372 -1.896401 0.958419
H  -4.862463 -3.132675 -0.983972
H  4.981711 -2.355098 0.475121
H  6.459559 -1.800715 -0.283269
H  -2.160543 -1.773905 -2.847924
elementType: O N C H
totalener: -1639.09866216 hartree
nucrepener: 3851.72266141 hartree
electener: -5490.82132357 hartree
oneelecener: -9936.29087986 hartree
twoeener: 4445.46955629 hartree
cpcmener: -0.14869392 hartree
kineticenergy: 1632.34078513 hartree
xcener: -152.461944577209 hartree
chargesum: -1.0000000
charge: -0.465213 -0.405082 -0.434813 -0.532267 -0.377316 -0.586812 -0.494568 -0.446052 -0.518771 -0.223325 -0.233303 0.273980 0.270306 -0.267865 0.557132 0.004159 0.536364 -0.360876 0.015629 0.111247 -0.156273 0.203020 0.156768 -0.214580 -0.335313 -0.024963 -0.266728 -0.200211 -0.208510 0.242096 0.334447 -0.111498 -0.239157 0.093312 0.083619 0.135328 0.124899 0.106139 0.107454 0.114226 0.236010 0.227892 0.223977 0.135095 0.066730 0.097685 0.111945 0.103700 0.103493 0.081956 0.272930 0.158319 0.135879 0.220394 0.189900 0.267463
qa: -0.4652 -0.4051 -0.4348 -0.5323 -0.3773 -0.5868 -0.4946 -0.4461 -0.5188 -0.2233 -0.2333 0.2740 0.2703 -0.2679 0.5571 0.0042 0.5364 -0.3609 0.0156 0.1112 -0.1563 0.2030 0.1568 -0.2146 -0.3353 -0.0250 -0.2667 -0.2002 -0.2085 0.2421 0.3344 -0.1115 -0.2392 0.0933 0.0836 0.1353 0.1249 0.1061 0.1075 0.1142 0.2360 0.2279 0.2240 0.1351 0.0667 0.0977 0.1119 0.1037 0.1035 0.0820 0.2729 0.1583 0.1359 0.2204 0.1899 0.2675
va: 1.9506 2.0556 2.0058 1.9533 2.1688 1.9027 1.9941 2.0410 1.9944 2.8948 3.2926 3.1711 3.4093 4.1832 3.6269 3.9838 3.6314 3.4860 4.4679 4.0202 3.6329 4.0933 4.1943 3.3480 3.9426 3.3155 3.9911 3.9721 3.9416 3.8838 4.2758 3.9247 4.0029 1.0511 1.0603 0.9955 0.9910 0.9969 1.0011 1.0057 1.0339 1.0115 1.0052 1.0341 0.9851 0.9914 0.9966 0.9960 0.9963 1.0058 1.0808 0.9893 1.0120 1.0270 1.0083 1.0637
dispersion: -0.040374142 hartree
energy: -1639.139036297905 hartree
dipole: -14.52354 13.35959 -1.16395 -2.55188 3.68958 1.13770 16.27492 -12.32341 3.95151
magnitude: 4.27359 au
magnitude: 10.86261 debye
