program: Gaussian 16
title: Title Card Required
version: ES64L-G16RevB.01
method: RB3LYP
basis: TZVP
operation: Freq
keyword: #P
keyword: Geom=AllCheck
keyword: Guess=TCheck
keyword: SCRF=Check
keyword: GenChk
keyword: RB3LYP/TZVP
keyword: Freq
converged: YES YES YES YES
title: Mulliken charges:
elementType: Cu N N C H C C H C H C C C H H H C H C H C H C C H C H H H C H H H C C C H C H C H C C H C H H H C H H H C H C H H H C H H H C H H H C H O H C H H C H H C C C C F F F H H H H H H
charge: -0.061137 0.029443 0.018023 -0.187614 0.166226 0.084176 -0.045123 0.147215 -0.026234 0.150461 -0.211054 0.224323 -0.392579 0.131626 0.117561 0.129367 -0.254266 0.129798 0.007025 0.122153 -0.259159 0.127912 0.206371 -0.143760 0.144601 -0.375145 0.134263 0.130911 0.115006 -0.378489 0.126700 0.132337 0.134971 -0.211790 0.189174 -0.254429 0.132960 0.018389 0.122357 -0.261930 0.133158 0.199497 -0.164894 0.162762 -0.383540 0.126049 0.136693 0.126915 -0.399185 0.135178 0.140552 0.142002 -0.190459 0.179276 -0.384833 0.128373 0.134369 0.125616 -0.388541 0.114162 0.140480 0.146598 -0.411655 0.193960 0.127851 0.127349 -0.277884 0.039442 -0.471786 0.092109 -0.200627 0.148999 0.157224 -0.352817 0.176318 0.158755 0.465254 0.215517 -0.375828 -0.360251 -0.184144 -0.182915 -0.176582 0.101326 0.096752 0.113588 0.092794 0.112669 0.103715
chargesum: -0.00000
title: Mulliken charges with hydrogens summed into heavy atoms:
elementType: Cu N N C C C C C C C C C C C C C C C C C C C C C C C C C C C C O C C C C C C F F F
charge: -0.061137 0.029443 0.018023 -0.021388 0.084176 0.102092 0.124227 -0.211054 0.224323 -0.014025 -0.124468 0.129179 -0.131246 0.206371 0.000841 0.005034 0.015519 -0.211790 0.189174 -0.121470 0.140746 -0.128773 0.199497 -0.002132 0.006116 0.018547 -0.011183 0.003525 0.012699 0.037505 -0.146333 -0.471786 0.105597 -0.017744 0.465254 0.215517 -0.064162 -0.051073 -0.184144 -0.182915 -0.176582
polarizability: 5.15837665e+02 -1.35191718e+01 5.50821365e+02 -2.09149514e+01 -9.24362038e+00 4.77732826e+02
1716.lowfreq: -449.0425 -5.6426 -0.0041 -0.0029 -0.0023 9.0902 9.9467 14.9388 21.5164
frequency: -449.0415 13.2791 21.3707 23.3670 32.2074 35.2220 37.8101 43.4791 47.8644 51.0173 53.9116 55.6167 60.3303 63.5505 68.6397 70.4946 80.8990 82.6087 88.1453 107.2294 117.6522 120.8535 132.6242 136.0857 137.5672 152.0865 162.5241 167.9376 177.9535 194.7373 218.7626 222.2265 235.5836 240.9821 242.3435 245.1685 246.2565 251.7171 258.9000 262.0660 264.0632 267.3045 278.6450 279.6526 282.4561 286.1406 291.9771 298.6259 312.0002 316.1876 320.2512 328.0663 330.2921 334.8166 354.3916 376.3076 389.5768 405.9940 415.6243 423.4119 435.0959 448.5459 452.2532 456.5783 462.6891 486.9407 504.1849 510.2296 535.1053 535.6851 535.8391 549.8935 556.0260 592.5562 597.4278 600.4241 630.8498 645.7833 651.2689 653.5692 658.5185 679.4555 712.1052 741.1276 745.6231 747.1247 758.8384 762.3424 773.8107 793.9345 806.1471 810.1725 820.8308 822.0844 829.0139 852.9762 858.0819 862.3202 892.6146 895.2563 896.2944 922.2490 924.5726 935.4583 943.3584 946.4479 947.8470 948.3097 950.9941 951.8240 972.4034 974.3998 974.5847 975.2880 976.7099 982.1449 984.1047 987.6483 997.3877 997.8600 1049.8437 1064.5617 1070.0350 1072.8077 1074.0572 1088.2179 1091.4933 1104.9446 1106.8620 1111.9435 1120.5662 1121.8242 1123.1703 1126.6687 1127.5052 1131.1152 1147.4242 1153.1977 1155.9360 1177.5060 1180.3213 1196.2642 1197.6580 1208.7773 1216.5336 1216.9374 1238.1022 1254.0059 1258.8074 1262.4552 1277.0110 1282.8980 1285.1098 1301.3026 1305.0777 1308.5310 1335.0944 1338.9004 1341.0990 1345.4619 1347.5364 1350.4117 1350.8905 1371.0498 1373.8533 1382.0740 1391.2261 1397.9074 1402.1208 1403.8362 1407.7149 1409.4503 1411.2825 1411.9925 1413.8673 1415.6399 1430.5921 1432.1922 1433.4736 1435.6647 1440.5465 1446.0246 1469.6986 1481.0056 1483.5741 1485.1274 1487.2708 1487.5950 1488.3647 1490.1473 1491.0979 1492.2463 1492.7648 1494.2541 1496.1426 1498.2485 1500.2406 1503.0134 1504.7689 1506.0592 1507.8096 1508.1451 1511.2729 1512.8501 1513.9585 1515.0672 1518.3980 1519.5568 1585.0174 1629.6647 1629.9858 1630.5284 1632.3676 2996.7410 3000.7330 3003.6252 3010.2142 3024.4183 3024.9545 3027.5220 3028.3198 3028.6014 3031.4967 3031.6625 3032.1290 3052.9218 3058.9159 3061.2741 3064.5786 3067.8864 3067.9709 3068.7488 3068.9099 3088.2319 3089.5239 3090.4750 3091.8435 3092.1736 3093.9529 3094.0688 3096.1526 3096.3055 3098.0593 3098.5317 3099.2133 3099.4776 3100.5787 3102.1851 3102.5276 3103.7635 3109.3909 3111.2337 3128.2205 3174.8827 3179.8965 3190.3572 3192.3916 3201.4561 3201.5879 3275.3375 3293.7529
redmass: 4.5095 6.6025 4.5643 3.7657 4.7056 4.8206 7.6783 6.3521 3.5354 3.2330 3.9442 4.3307 3.9253 4.1516 3.9104 3.1553 3.3838 3.6201 3.6785 5.7502 4.7854 7.5375 3.9407 3.4237 3.4789 5.1505 3.8836 3.5806 3.4715 3.6037 2.6358 1.7652 1.1154 1.2012 1.2070 1.1156 1.3247 2.5441 2.5668 1.5367 2.0102 1.6342 1.5829 1.0988 1.1427 1.9314 1.7213 1.8430 2.9395 2.8801 3.7796 3.3298 3.4009 3.7847 5.4678 3.7142 2.8533 3.6636 4.7023 3.3306 3.0083 3.6535 3.0629 2.5668 3.1365 3.7429 3.0559 3.3922 4.8369 5.0268 5.8934 8.4354 3.9457 3.2191 3.0173 3.0323 2.9912 3.6966 4.1065 3.3052 7.2765 4.3013 2.5258 2.0785 1.9483 4.7901 3.6095 3.6589 3.2795 1.3140 1.6595 1.8304 3.6353 3.7139 4.0609 1.4076 1.4373 1.5167 1.3902 2.5622 2.5832 1.3978 1.4208 1.5108 1.4679 1.2484 1.4430 1.2191 1.6771 1.7257 1.8651 1.8746 1.4952 2.0959 1.4993 1.3483 1.3242 1.3057 2.2976 4.1793 2.6049 1.7389 1.9690 2.0264 2.7645 1.5009 1.5187 1.7974 1.6662 2.4056 3.0803 2.3730 2.3793 2.3173 2.3536 2.3566 1.6236 2.1658 1.7624 2.0492 2.0386 1.7799 1.7854 2.7882 1.2843 1.3130 2.6155 2.3785 1.6922 3.0438 3.2015 2.1428 2.1535 4.1908 3.7164 3.7310 1.4933 1.7484 1.1502 1.6852 1.3191 1.4400 1.3399 2.8546 1.8179 1.2850 1.2505 1.4298 1.3734 1.3572 1.3692 1.6885 1.2489 1.3911 1.2509 1.3573 1.2212 1.2172 1.2181 1.3420 3.2491 2.2111 1.0501 1.0712 1.0590 1.0825 1.1108 1.1113 1.1395 1.1008 1.0680 1.1650 1.2094 1.1421 1.4007 1.4274 1.4576 1.4689 1.1423 1.1275 1.1199 1.0954 1.1835 1.1261 1.2109 1.3282 1.1474 1.1755 4.9184 5.7146 5.8090 5.9198 5.5893 1.0593 1.0561 1.0368 1.0395 1.0347 1.0348 1.0351 1.0349 1.0354 1.0354 1.0354 1.0354 1.0896 1.0848 1.0976 1.0611 1.0863 1.0966 1.0858 1.0867 1.1024 1.1027 1.1023 1.1020 1.1025 1.1019 1.1028 1.1026 1.1021 1.1024 1.1020 1.1019 1.1014 1.1017 1.0991 1.0997 1.0984 1.0999 1.1042 1.1166 1.0873 1.0867 1.0905 1.0914 1.0947 1.0963 1.0923 1.1106
irintensity: 1035.6685 0.8093 0.7885 0.0522 0.0921 0.3944 0.5402 1.9790 1.6124 2.5092 3.4922 5.1881 3.8196 0.5515 0.2335 1.4523 0.0431 2.2846 0.0676 2.0914 0.0803 1.0999 2.3009 1.3366 0.9608 1.4515 7.3740 0.9651 6.1613 1.5019 8.8501 0.4892 1.0624 1.8396 0.7858 0.5478 0.2331 30.2382 22.8978 3.3185 0.9033 0.3031 1.8043 0.1196 0.1261 0.2949 11.7775 1.6669 0.9714 0.4845 5.7236 7.2412 6.4532 23.3642 5.9585 4.2397 2.8145 12.7614 0.9862 3.8787 0.6660 52.4727 5.7644 0.2703 7.2829 0.0297 17.5350 11.1031 0.5905 0.1156 0.2332 6.0652 3.1781 0.0211 0.0190 0.0141 0.5388 3.7284 1.1105 5.4432 23.9812 0.0401 27.1479 94.0789 30.2277 1.5880 11.7480 13.6190 23.7034 0.3025 42.0251 31.6264 1.3261 2.1184 12.8935 0.1106 10.4400 40.1098 14.8575 1.5539 1.0415 1.0032 3.1193 29.2097 1.7197 0.9578 0.5675 3.1025 1.3916 16.7193 5.5824 4.9902 0.6426 6.4354 1.0841 22.2061 0.7496 0.1761 145.3004 3.8069 65.5532 25.7914 5.1542 5.4046 44.0266 2.8798 22.6775 45.1824 10.6142 6.8035 186.6774 4.8340 1.2877 3.3908 7.1513 2.5938 9.4906 90.4352 2.0895 0.5148 0.7722 1.0875 2.5401 34.1794 2.9731 10.0689 23.8835 151.3153 165.6254 7.1139 3.2319 4.6589 5.0674 13.4732 1.2575 6.9612 31.6778 1.1310 24.1182 4.0382 0.3710 0.9482 0.4650 23.9194 31.7873 31.0871 19.1599 2.0676 7.2929 109.2212 6.1006 2.0474 1.1052 7.6569 10.0019 13.5915 4.7095 5.1251 7.1156 34.9121 80.6083 186.1206 0.2967 0.1340 0.7526 18.0417 24.7327 12.3410 5.8376 1.0878 7.6779 5.4450 4.2260 4.3137 9.6638 2.5448 5.7696 17.7714 40.7414 3.4272 17.6092 29.2037 28.7058 7.1445 6.2034 15.4892 0.1737 16.9666 2.7720 2.7322 2.2710 8.6697 5.6916 6.7511 35.8893 31.4003 121.0820 21.2087 21.4517 27.6225 35.1057 27.8865 38.6373 18.8791 39.8253 16.7920 2.3993 6.1246 10.8692 1.6414 90.7564 1.8256 1.4871 22.4872 0.3848 17.8087 11.5967 1.2746 26.4180 39.8582 13.7222 91.3864 21.6962 12.8322 68.6193 33.7812 48.6920 36.6400 136.3049 30.5093 55.4284 5.6171 2.4439 4.1337 0.5110 9.2828 9.9494 20.1514 8.8057 11.4257 3.9525
temp: 298.150 k
press: 1.00000 atm
elementType: 29 7 7 6 1 6 6 1 6 1 6 6 6 1 1 1 6 1 6 1 6 1 6 6 1 6 1 1 1 6 1 1 1 6 6 6 1 6 1 6 1 6 6 1 6 1 1 1 6 1 1 1 6 1 6 1 1 1 6 1 1 1 6 1 1 1 6 1 8 1 6 1 1 6 1 1 6 6 6 6 9 9 9 1 1 1 1 1 1
symmnumber: 1
zpe: 1981691.1 jmol-1
zpe.correction: 0.754786 hartree
zpe.thermalcorrener: 0.800107 hartree
zpe.thermalcorrenthalpy: 0.801051 hartree
zpe.thermalcorrgfe: 0.673999 hartree
zpe.sumelectzpe: -3449.372911 hartree
zpe.sumelectthermal: -3449.327590 hartree
zpe.sumelectthermalent: -3449.326646 hartree
zpe.sumelectthermalfe: -3449.453698 hartree
dipole: 8.8545 6.9840 6.5029
dipole: 13.0180
quadrupole: -215.2259 -288.7077 -194.3248
quadrupole: 1.3785 44.3302 27.6703
quadrupole: 17.5269 -55.9549 38.4280 1.3785 44.3302 27.6703
hfenergy: -3450.1276971 hartree
pointgroup: C01 [X(C34H48Cu1F3N2O1)]
dipole: 3.4836407 2.7477205 2.5584568 debye
polarizability: 515.8376651|-13.5191718|550.8213654|-20.9149514|-9.2436204|477.7328264 unknown
InChI: InChI=1/C27H36N2.C4H6F3.C3H6O.Cu/c1-18(2)22-11-9-12-23(19(3)4)26(22)28-15-16-29(17-28)27-24(20(5)6)13-10-14-25(27)21(7)8;1-2-3-4(5,6)7;1-3(2)4;/h9-16,18-21H,1-8H3;1-3H2;1-2H3;/rC31H42CuF3N2.C3H6O/c1-20(2)24-12-9-13-25(21(3)4)28(24)36-18-19-37(30(36)32-17-11-16-31(33,34)35)29-26(22(5)6)14-10-15-27(29)23(7)8;1-3(2)4/h9-10,12-15,18-23H,11,16-17H2,1-8H3;1-2H3
charge 0 multiplicity 1
89 atoms
Cu 2.23655644 -1.08676741 4.34778508
N  3.45313838 0.79066216 6.24704153
N  4.66028533 -0.96723658 6.06669864
C  3.43641808 -3.32258 7.26271266
H  3.21387993 -2.27086427 7.4433837
C  3.52380078 -0.39770837 5.59782611
C  4.52438486 0.96092712 7.11142262
H  4.63736555 1.84344147 7.71546626
C  5.28442193 -0.15374778 7.00153078
H  6.19881983 -0.44200478 7.48876622
C  5.12753441 -2.26569905 5.65060319
C  4.55214258 -3.40193563 6.23272575
C  3.86484783 -3.93172427 8.60533923
H  3.06646798 -3.81914406 9.34324432
H  4.76077435 -3.44412562 8.99797114
H  4.0785517 -4.99882585 8.51004359
C  5.02199966 -4.64540642 5.80437064
H  4.59564676 -5.5475292 6.22368396
C  6.01097413 -4.740636 4.8383067
H  6.35791292 -5.71548364 4.51717001
C  6.54724077 -3.59450512 4.26339489
H  7.30178984 -3.69146154 3.49434916
C  6.11208017 -2.32874743 4.65157937
C  6.60845628 -1.07257174 3.94990233
H  6.48718242 -0.23182632 4.63477485
C  5.73439387 -0.78948535 2.71556036
H  5.83417222 -1.59291792 1.98151341
H  6.03189956 0.14755886 2.23835963
H  4.67923929 -0.71541333 2.98539326
C  8.09106735 -1.12680619 3.56695405
H  8.28488702 -1.86055328 2.78172554
H  8.71884552 -1.3760127 4.42537048
H  8.4111224 -0.15471783 3.18466397
C  2.36287416 1.7134059 6.06559649
C  2.43000106 2.6326867 5.00962831
C  1.33947685 3.4850548 4.83163857
H  1.34384531 4.19512131 4.01496051
C  0.23482863 3.41455876 5.66812313
H  -0.60730265 4.07451146 5.502541
C  0.19026488 2.48231368 6.69562484
H  -0.69063294 2.42397346 7.32145462
C  1.25248138 1.60500855 6.91565258
C  1.15700298 0.52569639 7.98337343
H  2.1462581 0.08539062 8.11215959
C  0.7281149 1.07894228 9.34798083
H  1.38592874 1.88744984 9.67498369
H  0.76429216 0.2875276 10.10030658
H  -0.29377559 1.4637404 9.32943677
C  0.21502265 -0.59603523 7.51771901
H  -0.80176063 -0.2200264 7.37977499
H  0.18123575 -1.40176435 8.25444007
H  0.54480493 -1.02233024 6.5682208
C  3.60115739 2.67203846 4.04054114
H  4.38759431 2.02489363 4.43020222
C  4.19507015 4.07974282 3.90260561
H  3.48521162 4.77713705 3.45287906
H  5.07972639 4.05343483 3.26181546
H  4.49190935 4.48277789 4.87357879
C  3.17963301 2.11022753 2.67369051
H  2.8170711 1.08395984 2.76610434
H  4.02535148 2.10613865 1.98242499
H  2.38035945 2.70681023 2.229991
C  2.15230364 -3.97882073 6.73334348
H  1.84650558 -3.58936161 5.75973994
H  1.33126 -3.82151577 7.43722715
H  2.27938564 -5.05680264 6.61107422
C  0.70470667 -1.69129007 3.01651696
H  0.41489509 -1.79048733 4.06575946
O  0.57900482 -4.22106107 3.63242057
H  1.6583784 -2.10456053 2.68214373
C  0.1456452 -0.49860606 2.25952057
H  0.92358898 0.01274263 1.68722902
H  -0.59463289 -0.83869707 1.52599172
C  -0.53276649 0.50837415 3.19410888
H  -1.31754403 0.02063184 3.77560271
H  0.18541068 0.93218437 3.89930107
C  -1.17475051 1.66344035 2.47612584
C  -0.06763571 -3.49342064 2.81258508
C  -1.54560479 -3.2176326 3.13294138
C  0.15785718 -3.74974642 1.31540257
F  -0.27196059 2.41683157 1.79409813
F  -1.80705619 2.50672808 3.33319481
F  -2.10489308 1.26817907 1.57192382
H  -1.65265712 -2.97237027 4.19143083
H  -1.98414812 -2.41931897 2.52777197
H  -2.11881434 -4.13290407 2.94607665
H  -0.24042706 -2.96058071 0.67187655
H  -0.338214 -4.68873441 1.04407226
H  1.22505091 -3.87028939 1.12096365
