program: Orca
programVersion: 5.0.2
elementType: O O O O O O O O O N N C C C C C C C C C C C C C C C C C C C C C C H H H H H H H H H H H H H H H H H H H H H H H
charge: -1
multiplicity: 1
keywords: wb97x-d3
keywords: def2-TZVPP
keywords: def2/J RIJCOSX
keywords: DEFGRID2
keywords: scfconv7
keywords: smallprint printgap noloewdin
keywords: NOSOSCF
formula: C22H23N2O9
InChI: InChI=1/C22H23N2O9/c1-21(32)7-5-4-6-8(25)9(7)15(26)10-12(21)17(28)13-14(24(2)3)16(27)11(20(23)31)19(30)22(13,33)18(10)29/h4-6,12-14,17,25-26,28,32-33H,23H2,1-3H3
56 atoms
O  0.050022 2.420304 2.298765
O  -0.943201 -0.318464 2.658805
O  1.952932 1.678828 -1.222854
O  -0.440854 -2.301544 0.240662
O  -3.08418 -1.47447 2.192862
O  1.83688 -2.518777 -0.49453
O  -3.040573 -0.00538 -2.28694
O  4.369798 -2.968123 -0.609516
O  -5.525035 -0.683742 -1.100466
N  -1.774665 2.358675 -1.301623
N  -5.209918 -2.093043 0.62469
C  -1.243611 1.100409 0.722793
C  1.335289 0.885054 0.917249
C  0.079556 1.803983 1.02689
C  -1.287908 -0.299108 1.294483
C  -1.557688 1.020631 -0.770986
C  2.458983 1.53043 0.092016
C  1.054312 -0.507333 0.420962
C  -0.228895 -1.132569 0.59758
C  -2.702126 -0.878286 1.158814
C  3.662679 0.588204 0.016228
C  -2.726626 0.056869 -1.112133
C  2.056191 -1.270367 -0.102583
C  -3.390009 -0.652999 -0.03606
C  2.838779 2.889981 0.676948
C  3.42652 -0.78249 -0.19107
C  4.963893 1.059448 0.02277
C  -1.354917 2.557956 -2.667653
C  -3.087465 2.911088 -1.059555
C  4.50877 -1.656942 -0.404516
C  -4.781181 -1.122455 -0.240799
C  6.029276 0.185886 -0.174046
C  5.811319 -1.155091 -0.393732
H  -2.029879 1.685771 1.212046
H  1.727555 0.794297 1.938816
H  0.154117 2.616244 0.301716
H  -0.673888 0.629736 -1.288789
H  1.970231 3.540128 0.743298
H  3.573237 3.404569 0.053569
H  3.256054 2.793401 1.679033
H  -0.238232 1.739506 2.918211
H  2.651692 2.029963 -1.781126
H  5.171856 2.105732 0.191187
H  -2.017611 2.100738 -3.41069
H  -1.301076 3.631821 -2.874265
H  -0.353445 2.150001 -2.804742
H  -3.062647 3.989428 -1.238929
H  -3.875211 2.478824 -1.689341
H  -3.382596 2.764159 -0.020036
H  -4.682143 -2.23515 1.473594
H  7.043011 0.565864 -0.159088
H  6.633796 -1.839623 -0.554036
H  -6.203228 -2.239609 0.650431
H  3.418498 -3.180207 -0.634507
H  0.830911 -2.690365 -0.276665
H  -1.666705 -0.884404 3.021006
totalener: -1638.99913042 hartree
nucrepener: 3790.77330033 hartree
electener: -5429.77243075 hartree
oneelecener: -9811.07816081 hartree
twoeener: 4381.30573005 hartree
kineticenergy: 1632.44240727 hartree
xcener: -152.447935109047 hartree
chargesum: -1.0000000
charge: -0.391410 -0.450014 -0.304861 -0.363665 -0.554281 -0.401309 -0.371139 -0.327577 -0.412831 -0.206544 -0.284100 0.115654 0.089773 0.035154 0.645381 -0.106739 0.478392 -0.402049 0.082560 0.225150 -0.185430 0.167866 0.252054 -0.215494 -0.342086 -0.076030 -0.156804 -0.175301 -0.208649 0.217058 0.216895 -0.096695 -0.190073 0.066076 0.074207 0.071722 0.096916 0.115925 0.066256 0.097965 0.186904 0.151825 0.114598 0.100751 0.063503 0.064704 0.072014 0.106060 0.085972 0.165790 0.111179 0.106641 0.115095 0.221191 0.237200 0.204649
qa: -0.3914 -0.4500 -0.3049 -0.3637 -0.5543 -0.4013 -0.3711 -0.3276 -0.4128 -0.2065 -0.2841 0.1157 0.0898 0.0352 0.6454 -0.1067 0.4784 -0.4020 0.0826 0.2251 -0.1854 0.1679 0.2521 -0.2155 -0.3421 -0.0760 -0.1568 -0.1753 -0.2086 0.2171 0.2169 -0.0967 -0.1901 0.0661 0.0742 0.0717 0.0969 0.1159 0.0663 0.0980 0.1869 0.1518 0.1146 0.1008 0.0635 0.0647 0.0720 0.1061 0.0860 0.1658 0.1112 0.1066 0.1151 0.2212 0.2372 0.2046
va: 2.0257 2.0440 2.1145 2.1756 1.9681 2.1189 2.1467 2.1884 2.1171 2.9126 3.0739 3.8566 3.7119 4.0463 3.7149 3.8820 3.8729 3.5550 4.0437 3.9181 3.9046 4.1481 3.9243 3.1739 3.9857 3.6387 3.9043 3.9429 3.9680 4.0187 4.3980 4.0088 3.9931 1.0590 1.0391 1.0716 1.0066 1.0146 1.0033 1.0070 1.0703 1.0648 1.0126 1.0122 0.9894 1.0129 0.9909 1.0076 0.9991 1.0718 1.0019 1.0196 1.0527 1.0832 1.1220 1.1007
dispersion: -0.037920263 hartree
energy: -1639.037050683641 hartree
dipole: 5.33944 -0.20442 5.13502 23.46188 -22.01744 1.44444 -2.95201 3.82301 0.87100
magnitude: 5.40495 au
magnitude: 13.73828 debye
