program: Orca
programVersion: 5.0.2
elementType: O O O O O O O O O N N C C C C C C C C C C C C C C C C C C C C C C H H H H H H H H H H H H H H H H H H H H H H H
charge: -1
multiplicity: 1
keywords: wb97x-d3
keywords: def2-TZVPP
keywords: def2/J RIJCOSX
keywords: DEFGRID2
keywords: scfconv7
keywords: smallprint printgap noloewdin
keywords: NOSOSCF
formula: C22H23N2O9
InChI: InChI=1/C22H23N2O9/c1-21(32)7-5-4-6-8(25)9(7)15(26)10-12(21)17(28)13-14(24(2)3)16(27)11(20(23)31)19(30)22(13,33)18(10)29/h4-6,12-14,17,25-26,28,32-33H,23H2,1-3H3
56 atoms
O  0.156842 -2.83374 -1.659441
O  -1.359265 -0.119811 -2.767708
O  2.894069 -2.389666 -1.743766
O  -0.675265 2.390575 -0.748811
O  -3.494774 0.937692 -2.157318
O  1.596393 2.584526 0.249076
O  -2.682529 0.36088 2.474792
O  3.457211 2.313362 2.04815
O  -5.554873 1.373169 -0.330287
N  -1.147967 -1.851421 1.756532
N  -4.859284 1.711515 1.782191
C  -1.12025 -1.049524 -0.544438
C  1.198601 -0.651994 -1.545552
C  0.259677 -1.661812 -0.854253
C  -1.442917 0.167988 -1.399524
C  -1.252139 -0.660974 0.931378
C  2.693986 -1.01585 -1.525034
C  0.952851 0.720335 -1.014769
C  -0.39669 1.23517 -1.071582
C  -2.888898 0.643667 -1.127222
C  3.348777 -0.584671 -0.222345
C  -2.489389 0.204684 1.260692
C  1.842747 1.355648 -0.205551
C  -3.331478 0.692714 0.217334
C  3.4113 -0.260602 -2.654454
C  3.013443 0.667749 0.325998
C  4.342122 -1.350653 0.355124
C  -2.339745 -2.657758 1.845911
C  -0.502544 -1.689481 3.035869
C  3.713819 1.144229 1.450975
C  -4.671252 1.272299 0.502846
C  5.022917 -0.870539 1.46862
C  4.726003 0.363146 2.007915
H  -1.876422 -1.810311 -0.768014
H  0.913344 -0.635551 -2.603335
H  0.692326 -2.005505 0.089075
H  -0.386207 -0.041702 1.196608
H  3.327666 0.820301 -2.545887
H  2.981468 -0.540636 -3.617905
H  4.470577 -0.519637 -2.664417
H  -0.318624 -2.577258 -2.458104
H  2.031907 -2.829048 -1.796979
H  4.586017 -2.314738 -0.065959
H  -2.8128 -2.758716 0.868669
H  -2.073573 -3.66426 2.17979
H  -3.092315 -2.258581 2.537739
H  -0.193328 -2.66974 3.411386
H  0.402253 -1.090203 2.920843
H  -1.128176 -1.21186 3.797671
H  -2.203194 0.29165 -3.083779
H  5.802303 -1.471718 1.920046
H  5.253202 0.738903 2.874905
H  -4.200296 1.401598 2.484301
H  -5.807923 1.913921 2.042018
H  2.719689 2.749742 1.591126
H  0.669694 2.823658 -0.083466
totalener: -1639.00252249 hartree
nucrepener: 3825.46610648 hartree
electener: -5464.46862896 hartree
oneelecener: -9879.71840812 hartree
twoeener: 4415.24977915 hartree
kineticenergy: 1632.43681640 hartree
xcener: -152.449809899853 hartree
chargesum: -1.0000000
charge: -0.374706 -0.434448 -0.408271 -0.362305 -0.410225 -0.380728 -0.506330 -0.323650 -0.405435 -0.210701 -0.291218 0.116747 0.093472 -0.086810 0.519258 -0.021489 0.530394 -0.376493 0.052988 0.195253 -0.124036 0.180245 0.202187 -0.201267 -0.319480 -0.044820 -0.198949 -0.201396 -0.171253 0.235932 0.209546 -0.067921 -0.198608 0.066134 0.101477 0.109766 0.082629 0.094030 0.076856 0.093182 0.186282 0.203947 0.116844 0.089553 0.080511 0.089329 0.072591 0.069000 0.096499 0.202751 0.111651 0.105001 0.169517 0.115770 0.217063 0.234136
qa: -0.3747 -0.4344 -0.4083 -0.3623 -0.4102 -0.3807 -0.5063 -0.3236 -0.4054 -0.2107 -0.2912 0.1167 0.0935 -0.0868 0.5193 -0.0215 0.5304 -0.3765 0.0530 0.1953 -0.1240 0.1802 0.2022 -0.2013 -0.3195 -0.0448 -0.1989 -0.2014 -0.1713 0.2359 0.2095 -0.0679 -0.1986 0.0661 0.1015 0.1098 0.0826 0.0940 0.0769 0.0932 0.1863 0.2039 0.1168 0.0896 0.0805 0.0893 0.0726 0.0690 0.0965 0.2028 0.1117 0.1050 0.1695 0.1158 0.2171 0.2341
va: 2.0314 2.0744 2.0490 2.1605 2.1198 2.1502 2.0106 2.1885 2.1244 2.9064 3.0771 3.6623 3.5911 3.9870 3.7840 4.0011 3.6560 3.7319 4.0753 4.0794 3.8559 4.0497 3.9003 3.2232 3.9555 3.4811 4.0218 3.9602 3.9478 4.0033 4.4271 3.9288 3.9936 1.0584 1.0444 1.0449 1.0056 0.9996 1.0190 1.0109 1.0546 1.0959 1.0425 1.0001 0.9930 1.0086 0.9903 1.0017 1.0114 1.1087 1.0010 1.0196 1.0793 1.0521 1.0800 1.1106
dispersion: -0.038323988 hartree
energy: -1639.040846474131 hartree
dipole: 8.83190 -4.68468 4.14721 -16.79486 15.42573 -1.36912 7.73641 -7.22407 0.51235
magnitude: 4.39731 au
magnitude: 11.17708 debye
