program: Gaussian 09
title: Title
version: ES64L-G09RevD.01
method: RB3LYP
basis: Gen
operation: Freq
keyword: #PGeom=AllCheck
keyword: Guess=TCheck
keyword: SCRF=Check
keyword: GenChk
keyword: RB3LYP/ChkBas
keyword: Freq
converged: YES YES YES YES
title: Mulliken charges:
elementType: Cu N N C H C C H C H C C C H H H C H C H C H C C H C H H H C H H H C C C H C H C H C C H C H H H C H H H C H C H H H C H H H C H H H I
charge: 0.043040 0.023589 0.022638 -0.158773 0.153920 0.066763 -0.034963 0.146965 -0.038721 0.145773 -0.217285 0.215097 -0.385665 0.133891 0.125699 0.126606 -0.265633 0.129395 0.011638 0.121439 -0.264008 0.128959 0.217090 -0.178382 0.172960 -0.392885 0.131707 0.133588 0.145340 -0.389221 0.127134 0.122934 0.133181 -0.215924 0.212142 -0.259103 0.128577 0.007779 0.121468 -0.267163 0.128500 0.215499 -0.172831 0.170771 -0.392056 0.122570 0.133169 0.127915 -0.395575 0.131667 0.134312 0.147033 -0.153537 0.147612 -0.380579 0.126054 0.134776 0.128902 -0.383402 0.140053 0.129048 0.133501 -0.383785 0.141865 0.129514 0.132895 -0.575483
chargesum: 0.00000
title: Mulliken charges with hydrogens summed into heavy atoms:
elementType: Cu N N C C C C C C C C C C C C C C C C C C C C C C C C C C C I
charge: 0.043040 0.023589 0.022638 -0.004853 0.066763 0.112002 0.107052 -0.217285 0.215097 0.000531 -0.136237 0.133077 -0.135048 0.217090 -0.005422 0.017751 -0.005971 -0.215924 0.212142 -0.130525 0.129247 -0.138663 0.215499 -0.002059 -0.008402 0.017438 -0.005925 0.009153 0.019200 0.020489 -0.575483
polarizability: 4.31636478e+02 -1.13492616e+01 4.85972951e+02 -3.72928277e+01 -1.05275086e+01 4.33616649e+02
1716.lowfreq: -11.1261 -0.0013 0.0027 0.0029 1.2539 8.2186 22.6384 25.3880 28.0042
frequency: 19.7691 24.8796 27.2076 29.7614 43.2028 53.4708 57.4129 64.3277 68.0446 70.2465 80.4717 84.0801 98.4004 106.8954 116.4289 130.5154 135.3598 157.2281 160.9443 165.4811 172.8937 219.9702 237.1317 243.2432 245.8110 248.0276 260.7096 265.1782 267.9144 271.2691 278.7704 281.1486 287.3482 289.2577 299.9249 309.7803 313.4376 317.9616 328.8949 331.2496 356.2524 415.4062 422.7106 435.6267 451.5774 456.4649 463.2631 486.6536 534.6832 535.4764 557.5009 593.8396 596.6249 600.0636 631.7776 646.7417 650.0124 652.7921 679.7031 709.9551 747.1037 749.1385 761.7738 764.6423 775.6355 808.6777 812.9931 821.4517 821.9353 857.0866 897.1658 897.8426 920.4486 926.2325 947.3737 947.6539 948.5771 950.0848 952.1213 953.7009 972.0264 973.9118 975.5673 976.9222 978.7389 984.7774 987.4157 996.4120 1069.7025 1072.3749 1089.1663 1091.7843 1106.7453 1110.1643 1123.3631 1124.5965 1127.7698 1128.5188 1129.1817 1146.9800 1154.9103 1178.3422 1180.0340 1196.9878 1197.8026 1216.2062 1216.3821 1237.4538 1262.2165 1275.1383 1283.0592 1283.8492 1297.4752 1306.2606 1307.3678 1337.5305 1343.0895 1346.0787 1346.8482 1349.9613 1366.3580 1372.9787 1398.0431 1400.9986 1407.4735 1408.9301 1411.3034 1411.7622 1413.1462 1430.2148 1431.6216 1432.0160 1434.5239 1438.1452 1481.4395 1483.9365 1484.4952 1486.7678 1487.8786 1488.3355 1490.1268 1492.4335 1494.7222 1497.4644 1498.5672 1501.4529 1502.3779 1504.1977 1505.5510 1507.0287 1510.1261 1513.1774 1513.7531 1515.5902 1586.7247 1630.5169 1631.0080 1631.7163 1632.1154 3025.3685 3025.5641 3026.7603 3027.1212 3029.4372 3029.5644 3030.4168 3032.3686 3061.2506 3066.3687 3067.4668 3067.9363 3089.5626 3090.1710 3090.4048 3090.7286 3093.2038 3093.2821 3094.2248 3095.3369 3095.8927 3096.6020 3099.1470 3100.5296 3101.5465 3102.4007 3103.0794 3104.6665 3173.0379 3174.0707 3189.8743 3191.2056 3199.5004 3200.1742 3276.0054 3294.6073
redmass: 4.4390 6.8144 5.0659 4.9509 4.6196 3.6529 3.1286 4.6015 4.4306 2.7663 2.7505 3.2998 4.2068 12.1494 4.3638 3.1656 3.2646 4.9489 4.7672 3.6959 3.1709 2.6707 1.1592 1.2144 1.1506 1.2095 2.7187 1.2958 2.2212 1.6757 1.3827 1.2663 1.8422 1.7285 1.9132 2.8578 2.8977 3.7943 3.2912 3.1519 6.6975 4.7891 3.2279 3.0099 3.1450 2.5741 3.0862 3.7728 4.8604 4.4484 3.9718 3.2591 3.0446 2.9790 2.9360 3.8369 4.1489 3.2251 4.4170 3.1986 5.4483 1.6079 4.5208 2.7481 2.9997 1.8722 1.7907 3.6923 3.7388 1.3881 2.6019 2.6125 1.4025 1.4018 1.2805 1.4257 1.2583 1.4874 1.5558 1.6570 3.6394 1.7534 1.5019 1.5150 1.4997 1.3069 1.3021 4.3078 1.9974 2.0135 1.5158 1.5186 1.7277 2.2174 2.3192 2.3678 2.2879 2.3389 2.3842 1.6022 1.7183 2.0326 2.0359 1.7699 1.7422 1.3110 1.3025 2.6583 3.0353 3.6245 2.0801 2.1452 3.8481 3.6985 3.6269 1.6254 1.6139 1.4989 1.3412 1.4966 3.5824 1.5597 1.4112 1.3807 1.5110 1.5439 1.2645 1.2567 1.3025 1.2182 1.2236 1.2176 1.2202 3.0742 1.0695 1.0667 1.0660 1.1052 1.0529 1.0586 1.1043 1.1302 1.7108 1.3751 1.6046 1.3631 1.0508 1.0937 1.0701 1.1951 1.2160 1.5460 1.1298 1.3765 4.9129 5.7528 5.8846 5.3867 6.1782 1.0347 1.0346 1.0346 1.0350 1.0352 1.0352 1.0354 1.0355 1.0848 1.0859 1.0864 1.0864 1.1025 1.1025 1.1024 1.1025 1.1026 1.1026 1.1026 1.1022 1.1024 1.1022 1.1017 1.1006 1.0989 1.0987 1.0984 1.1002 1.0872 1.0870 1.0916 1.0906 1.0952 1.0945 1.0922 1.1105
irintensity: 0.4035 0.6791 0.4845 0.3368 0.2440 0.2160 0.1609 0.9974 1.5488 0.1075 0.0630 0.0192 0.1085 0.3896 0.8516 0.0230 0.0203 2.5734 1.0946 0.8874 2.6689 4.3703 0.2017 1.3482 0.8561 0.2147 3.5327 1.0765 0.1512 1.7076 1.1232 0.4081 0.7927 2.9798 2.1860 0.1993 0.1692 3.1467 1.9115 0.7634 3.5608 0.3385 2.2118 0.4262 7.6319 0.2802 6.9623 0.1547 0.6009 0.1067 3.3638 0.0512 0.0446 0.0538 0.2032 3.3373 1.1561 6.4892 0.0736 21.0842 0.5908 39.5665 1.3627 26.8651 20.2046 29.5562 31.6797 0.4173 3.8202 0.0729 0.4400 0.4844 0.8830 1.0998 0.7676 2.4201 1.4459 5.6724 1.5299 11.7084 17.1827 3.8358 0.7241 0.4748 0.8654 0.3524 0.3826 1.0620 5.9096 1.1188 0.1095 25.0502 6.5523 6.8102 3.4492 4.4098 0.3993 7.4015 3.4043 12.1768 0.5429 1.1353 0.4282 0.1087 2.8313 1.1806 13.6757 22.8829 1.4699 1.7473 2.1076 8.5262 18.7888 0.1284 8.8288 2.5185 3.8902 0.0363 1.7319 0.4486 29.2499 39.8557 3.4110 6.4977 7.4302 1.4599 2.7077 1.7664 11.9634 3.7080 3.3447 6.6882 4.6976 93.9581 12.8227 10.9097 6.1767 14.3698 0.2587 2.9383 3.7470 3.0137 19.5876 0.6233 2.0080 25.0394 16.7933 1.9391 15.1217 21.8072 26.4681 0.4672 9.8289 10.4343 3.7853 3.3002 1.1756 3.5139 10.3178 8.0214 15.3358 32.1358 32.1186 42.3273 19.6020 51.7213 37.5795 2.0289 0.4948 0.8288 0.4140 0.4411 9.9490 9.4867 5.6882 10.6424 31.3039 45.4095 13.1171 70.0466 8.2735 61.2222 40.6577 73.5835 139.5054 32.8253 31.5362 3.9168 3.5078 12.5531 12.5758 18.2616 13.4101 10.9507 3.8491
temp: 298.150 k
press: 1.00000 atm
elementType: 29 7 7 6 1 6 6 1 6 1 6 6 6 1 1 1 6 1 6 1 6 1 6 6 1 6 1 1 1 6 1 1 1 6 6 6 1 6 1 6 1 6 6 1 6 1 1 1 6 1 1 1 6 1 6 1 1 1 6 1 1 1 6 1 1 1 53
symmnumber: 1
zpe: 1503369.9 jmol-1
zpe.correction: 0.572603 hartree
zpe.thermalcorrener: 0.606373 hartree
zpe.thermalcorrenthalpy: 0.607317 hartree
zpe.thermalcorrgfe: 0.505257 hartree
zpe.sumelectzpe: -3098.460533 hartree
zpe.sumelectthermal: -3098.426763 hartree
zpe.sumelectthermalent: -3098.425819 hartree
zpe.sumelectthermalfe: -3098.527880 hartree
dipole: 8.1235 2.1085 7.5860
dipole: 11.3130
quadrupole: -214.8706 -199.3095 -253.7106
quadrupole: -4.1108 -28.7315 -8.8174
quadrupole: 7.7597 23.3207 -31.0804 -4.1108 -28.7315 -8.8174
hfenergy: -3099.0331362 hartree
pointgroup: C01 [X(C27H36Cu1I1N2)]
dipole: 3.1960418 0.8295336 2.9845665 debye
polarizability: 431.6364782|-11.3492616|485.9729509|-37.2928277|-10.5275086|433.6166494 unknown
InChI: InChI=1/C27H36N2.Cu.HI/c1-18(2)22-11-9-12-23(19(3)4)26(22)28-15-16-29(17-28)27-24(20(5)6)13-10-14-25(27)21(7)8;;/h9-16,18-21H,1-8H3;;1H/q;+1;/p-1/rC27H36CuIN2/c1-17(2)21-11-9-12-22(18(3)4)25(21)30-15-16-31(27(30)28-29)26-23(19(5)6)13-10-14-24(26)20(7)8/h9-20H,1-8H3
charge 0 multiplicity 1
67 atoms
Cu -0.16076759 -0.13259571 -2.71771292
N  1.62188173 1.42380513 -0.92716543
N  2.04777548 -0.67036265 -0.83578095
C  0.29575423 -2.22592562 0.85201303
H  0.66675331 -1.2158974 1.0298342
C  1.23144807 0.22975786 -1.44047031
C  2.65661114 1.27198909 -0.01521354
H  3.09496475 2.11028357 0.49628485
C  2.92863475 -0.05231467 0.03951397
H  3.65215886 -0.60717523 0.60982579
C  1.97211129 -2.08880449 -1.07186711
C  1.14687105 -2.85756787 -0.23887204
C  0.38172334 -2.9783013 2.18560817
H  -0.17316845 -2.43829291 2.95666916
H  1.41606794 -3.07938933 2.52245905
H  -0.0485257 -3.97982367 2.1179098
C  1.0724619 -4.22587634 -0.49801125
H  0.43843898 -4.85266535 0.11536501
C  1.78541543 -4.79325297 -1.54564352
H  1.70948195 -5.85743826 -1.7345053
C  2.58049362 -4.0031118 -2.36323025
H  3.11102387 -4.45715084 -3.19041427
C  2.6890114 -2.62857234 -2.14746745
C  3.5039104 -1.76329123 -3.0958643
H  3.54426946 -0.75404075 -2.68517788
C  2.81076444 -1.67362156 -4.46422051
H  2.75626288 -2.65447212 -4.94240546
H  3.36064165 -1.00408696 -5.12971944
H  1.79005951 -1.29621879 -4.36989581
C  4.95087441 -2.25380698 -3.23479892
H  5.00231566 -3.24363927 -3.69363213
H  5.44843476 -2.30966774 -2.26365848
H  5.52144293 -1.56990375 -3.86794208
C  1.01274259 2.67847623 -1.28448101
C  1.60043769 3.43811742 -2.30728448
C  0.98312318 4.64188488 -2.64449277
H  1.39895178 5.25541051 -3.43255089
C  -0.17124439 5.05883838 -1.99381575
H  -0.63860715 5.99493236 -2.27507463
C  -0.73683903 4.27801348 -0.99710533
H  -1.64738253 4.60703247 -0.51282605
C  -0.15777419 3.06491187 -0.62005894
C  -0.82277683 2.19521824 0.43568787
H  -0.17765818 1.33779591 0.62981277
C  -1.001782 2.93974265 1.76568887
H  -0.04893487 3.32036969 2.14108579
H  -1.41826251 2.26822433 2.52059944
H  -1.68482076 3.78639389 1.666753
C  -2.16148422 1.64974266 -0.08424454
H  -2.8679314 2.45980967 -0.2800117
H  -2.61409471 0.97866312 0.64937218
H  -2.03004681 1.09491342 -1.01590672
C  2.80821967 2.92985238 -3.080424
H  3.32227164 2.19586518 -2.45795112
C  3.82483694 4.02899099 -3.4098603
H  3.42793623 4.75395082 -4.1237766
H  4.71624805 3.58781062 -3.86199925
H  4.13484588 4.5724348 -2.51438045
C  2.34690322 2.20681044 -4.35716873
H  1.64974337 1.39837211 -4.12987189
H  3.20209589 1.78095562 -4.88772347
H  1.83891175 2.89983613 -5.03218882
C  -1.16124629 -2.10142601 0.37801091
H  -1.23130017 -1.54043598 -0.55616802
H  -1.76676598 -1.58884515 1.12938726
H  -1.60001203 -3.08694306 0.20411912
I  -1.93626441 -0.60439976 -4.37952061
