program: Gaussian 09
title: Title Card Required
version: ES64L-G09RevD.01
method: RB3LYP
basis: Gen
operation: Freq
keyword: #P
keyword: Geom=AllCheck
keyword: Guess=TCheck
keyword: SCRF=Check
keyword: GenChk
keyword: RB3LYP/ChkBas
keyword: Freq
converged: YES YES YES YES
title: Mulliken charges:
elementType: Cs F
charge: 0.804930 -0.804930
chargesum: 0.00000
title: Mulliken charges with hydrogens summed into heavy atoms:
polarizability: 3.38341856e+01 -1.16319848e-10 2.35039978e+01 -6.73279971e-10 9.97420485e-11 2.35039978e+01
1716.lowfreq: -0.0004 0.0006 0.0006 34.4683 34.4683 257.4475
frequency: 257.4475
redmass: 21.2793
irintensity: 91.9650
temp: 298.150 k
press: 1.00000 atm
elementType: 55 9
symmnumber: 1
zpe: 1539.9 jmol-1
zpe.correction: 0.000587 hartree
zpe.thermalcorrener: 0.003423 hartree
zpe.thermalcorrenthalpy: 0.004367 hartree
zpe.thermalcorrgfe: -0.023666 hartree
zpe.sumelectzpe: -120.121306 hartree
zpe.sumelectthermal: -120.118470 hartree
zpe.sumelectthermalent: -120.117526 hartree
zpe.sumelectthermalfe: -120.145559 hartree
dipole: 10.4205 0.0000 0.0000
dipole: 10.4205
quadrupole: -40.0683 -24.0449 -24.0449
quadrupole: -21.3667 0.0000 0.0000
quadrupole: -10.6823 5.3411 5.3411 -21.3667 0.0000 0.0000
hfenergy: -120.1218928 hartree
pointgroup: C*V [C*(F1Cs1)]
dipole: 4.0997406 0. 0. debye
dipolederiv: 1.2522215 0. 0. 0. 0.8355293 0. 0. 0. 0.8355293 -1.2522215 0. 0. 0. -0.8355293 0. 0. 0. -0.8355293 unknown
polarizability: 33.8341856|0.|23.5039978|0.|0.|23.5039978 unknown
InChI: InChI=1/Cs.FH/h;1H/q+1;/p-1
charge 0 multiplicity 1
2 atoms
Cs 0.63758646 -2.05045275 0.0000
F  -1.96344668 -2.05045275 0.0000
