program: Gaussian 09
title: Title
version: ES64L-G09RevD.01
method: RB3LYP
basis: TZVP
operation: Freq
keyword: #PGeom=AllCheck
keyword: Guess=TCheck
keyword: SCRF=Check
keyword: GenChk
keyword: RB3LYP/TZVP
keyword: Freq
converged: YES YES YES YES
title: Mulliken charges:
elementType: B C H C H H C H H C H H C H C H H C H H C H H F
charge: 0.305882 -0.117208 0.158863 -0.311438 0.130887 0.126265 -0.220459 0.139796 0.121569 -0.311393 0.126533 0.130849 -0.117182 0.158857 -0.311140 0.130849 0.126367 -0.220780 0.139861 0.121546 -0.310941 0.126509 0.130879 -0.254970
chargesum: 0.00000
title: Mulliken charges with hydrogens summed into heavy atoms:
elementType: B C C C C C C C C F
charge: 0.305882 0.041655 -0.054286 0.040906 -0.054011 0.041675 -0.053924 0.040627 -0.053553 -0.254970
polarizability: 1.16087118e+02 -6.28097187e-01 1.09840460e+02 -3.11537534e-01 1.70577858e-01 1.15810882e+02
1716.lowfreq: -17.8160 -0.0011 -0.0010 -0.0008 12.3519 23.2399 60.1274 101.7567 220.9528
frequency: 60.1152 101.7188 220.9386 263.0211 292.4035 307.0020 367.6324 369.7414 418.3859 484.4348 582.0674 634.8886 698.8502 741.1387 777.4665 778.1899 819.2765 856.3620 897.3260 913.9598 918.8497 922.8217 1003.9075 1012.2290 1063.9590 1070.9229 1092.9388 1108.7265 1126.4148 1159.5949 1160.1260 1171.3408 1173.7524 1259.4310 1279.2875 1290.5598 1292.8263 1326.3938 1346.4353 1357.5040 1364.5958 1383.7975 1388.4159 1391.1287 1393.9374 1420.4197 1484.3381 1485.1469 1494.1904 1499.9097 1501.4212 1526.5712 2998.1904 2998.9246 3000.6819 3001.8533 3028.5683 3029.6022 3032.4340 3032.5508 3033.0786 3035.8180 3036.5224 3041.9175 3082.8979 3107.7391
redmass: 6.4179 2.2367 1.7064 2.6490 3.7330 4.6870 1.6661 2.9942 5.2879 2.2041 4.4126 2.7721 3.4694 1.7004 2.7360 3.1629 2.9840 1.3757 2.1638 2.6530 1.5171 2.5349 1.8364 1.8318 2.7179 1.9809 3.1773 1.2699 1.6067 1.5075 1.1595 2.9681 1.0854 1.3158 1.4345 1.2058 1.6510 1.1708 1.6685 1.3045 1.5086 1.3096 1.2796 1.3691 1.6260 1.9358 1.0813 1.0726 1.0840 1.0926 1.0853 1.0858 1.0631 1.0609 1.0612 1.0597 1.1003 1.1015 1.0997 1.1017 1.0846 1.0832 1.0733 1.0770 1.0951 1.0885
irintensity: 0.4260 0.0021 0.1085 1.7278 0.5379 0.0004 0.8554 7.2840 0.3320 1.1937 0.9087 2.9148 22.4619 0.8746 0.5232 0.3886 0.0010 0.0015 0.1005 4.0211 20.3751 0.1392 6.9981 0.1556 4.3623 12.4184 0.0053 26.9536 5.1397 42.7733 8.1160 67.9016 0.1255 0.1505 7.4777 3.6031 152.2893 0.0162 29.7532 0.0177 74.4447 2.2233 1.7685 0.0233 30.3894 143.7552 0.0941 0.0824 13.1446 8.6700 3.4007 14.8487 0.6869 85.7930 69.6116 0.9524 20.0607 79.7776 66.6159 32.9538 73.1635 78.6084 100.1886 1.4910 58.0955 67.1161
temp: 298.150 k
press: 1.00000 atm
elementType: 5 6 1 6 1 1 6 1 1 6 1 1 6 1 6 1 1 6 1 1 6 1 1 9
symmnumber: 1
zpe: 559359.4 jmol-1
zpe.correction: 0.213049 hartree
zpe.thermalcorrener: 0.221939 hartree
zpe.thermalcorrenthalpy: 0.222883 hartree
zpe.thermalcorrgfe: 0.179232 hartree
zpe.sumelectzpe: -438.016337 hartree
zpe.sumelectthermal: -438.007446 hartree
zpe.sumelectthermalent: -438.006502 hartree
zpe.sumelectthermalfe: -438.050153 hartree
dipole: 0.1648 1.7933 -0.0427
dipole: 1.8013
quadrupole: -60.9412 -62.4857 -61.6933
quadrupole: -0.2488 -0.6676 0.1661
quadrupole: 0.7655 -0.7790 0.0135 -0.2488 -0.6676 0.1661
hfenergy: -438.2293857 hartree
pointgroup: C01 [X(C8H14B1F1)]
dipole: 0.0648386 0.7055319 -0.0168135 debye
dipolederiv: 0.6392233 0.1156545 0.3190687 0.1170626 1.8638484 -0.0480873 0.3131777 -0.0503832 1.0044192 -0.2134906 0.1270764 -0.0187811 0.0898791 -0.3113624 0.1713812 -0.0141429 0.2352647 -0.284236 -0.0558345 -0.0811942 -0.0735062 -0.0653589 -0.0128362 -0.1107594 -0.0758042 -0.1372479 -0.1092219 0.2061783 -0.0400443 0.0393376 -0.0049423 0.178743 -0.0485485 -0.0882325 0.0283538 0.1214325 -0.1370959 -0.0893919 0.0496265 -0.1204508 -0.0369949 -0.0048289 0.0917232 0.0231391 0.0129466 -0.0012356 0.055797 -0.0506513 0.1168306 -0.0773856 0.087719 -0.093934 0.094712 -0.1107183 0.0960194 0.0553239 -0.0163243 0.0230231 0.0649279 -0.0130618 -0.0175628 -0.0325503 0.0734389 -0.1259793 0.131442 0.0884202 0.0924397 -0.0012094 -0.0539663 0.0872195 -0.0765311 -0.0326181 -0.0077177 -0.1285799 -0.0112739 -0.1068211 -0.0770867 0.0591135 -0.0107376 0.0687515 -0.0112033 0.1660323 -0.0377577 -0.116118 0.0401412 0.1770032 0.0300869 0.0194928 0.0230273 0.1651706 -0.0223571 -0.0500499 -0.1111101 -0.0152758 -0.0642441 -0.1410372 -0.0648107 -0.0929368 -0.1031004 -0.0890737 -0.069284 0.1207866 -0.0588328 -0.0425383 0.1039331 0.0782958 0.063752 -0.0304875 -0.2575223 -0.1398093 -0.0447092 -0.1025218 -0.2882592 -0.1645537 -0.0513698 -0.226843 -0.2652012 -0.0281806 0.0817956 -0.0557877 0.06646 -0.0282978 0.118382 -0.0529074 0.1444621 -0.121385 0.2153016 0.0344693 0.0459798 -0.0047483 0.1708819 0.0371455 -0.0919617 -0.0141851 0.120435 -0.0963664 0.1038726 0.0453025 0.1354733 -0.0793246 0.0001806 0.0798757 -0.0352147 0.0146925 -0.0361547 -0.0670409 -0.063313 -0.1303098 -0.0514649 -0.0792931 -0.1038246 -0.0780474 -0.1025583 0.0797742 -0.0591836 -0.010741 -0.0257434 0.0832702 0.0154979 -0.0097443 0.0340291 0.0700135 -0.161097 -0.0959133 0.1018091 -0.0572306 0.0392872 0.0337068 0.1023073 0.0558636 -0.0375221 0.0317731 0.1060721 -0.0276625 0.0846095 -0.1269152 -0.0510468 -0.0279419 -0.060135 -0.0071257 0.1627494 0.0375883 -0.1216464 -0.0365957 0.1747342 -0.0107931 0.0158384 -0.0254957 0.1688142 -0.0121741 0.0361377 -0.0842405 0.0045173 -0.0628466 0.1574316 -0.0476026 0.1016592 -0.11479 -0.063393 0.0780755 0.0964481 0.0646044 -0.0748117 -0.1218142 0.0629874 -0.0761811 -0.0223094 -0.2893791 -0.1050559 -0.1009137 -0.1062094 -1.4171187 0.0332123 -0.1003409 0.0327369 -0.3988857 unknown
polarizability: 116.0871183|-0.6280972|109.8404596|-0.3115375|0.1705779|115.8108823 unknown
InChI: InChI=1/C8H14BF/c10-9-7-3-1-4-8(9)6-2-5-7/h7-8H,1-6H2
charge 0 multiplicity 1
24 atoms
B  -0.01337152 0.41792593 0.03989749
C  -0.59225046 1.29632913 -1.11332911
H  -1.10239392 0.70842034 -1.88243317
C  -1.6335593 2.25568588 -0.4667105
H  -2.50180892 1.6546377 -0.17310265
H  -1.99700873 2.96323105 -1.22017965
C  -1.13281215 3.03466159 0.76537116
H  -1.99522245 3.47280742 1.27703976
H  -0.52736288 3.88017273 0.44163785
C  -0.33784424 2.18649645 1.77711286
H  0.14914581 2.84780922 2.50217113
H  -1.04191072 1.57420773 2.35218643
C  0.7196161 1.2295374 1.15384247
H  1.1170552 0.59514206 1.9519638
C  1.91627993 1.95031604 0.4674536
H  2.65789727 1.18663053 0.20681967
H  2.40647822 2.61432465 1.18796772
C  1.56191586 2.74797411 -0.80273489
H  2.4879743 2.99486052 -1.33084465
H  1.12416998 3.70509643 -0.52251145
C  0.61952134 2.01387779 -1.77678177
H  0.25769701 2.71967825 -2.53260934
H  1.19641293 1.25737101 -2.32114276
F  -0.13476848 -0.92273511 0.07037048
