program: Gaussian 16
title: Title Card Required
version: EM64L-G16RevB.01
method: RB3LYP
basis: TZVP
operation: Freq
keyword: #P
keyword: Geom=AllCheck
keyword: Guess=TCheck
keyword: SCRF=Check
keyword: GenChk
keyword: RB3LYP/TZVP
keyword: Freq
converged: YES YES YES YES
title: Mulliken charges:
elementType: C C C O F F F F F F
charge: 0.074111 0.459992 0.459299 -0.167295 -0.130932 -0.141066 -0.141049 -0.141162 -0.141122 -0.130774
chargesum: 0.00000
title: Mulliken charges with hydrogens summed into heavy atoms:
polarizability: 4.40905831e+01 -2.74372948e+00 4.30412421e+01 7.78208747e-01 4.11011724e+00 4.04344991e+01
1716.lowfreq: -18.0423 0.0007 0.0008 0.0011 11.4015 19.3963 36.7121 53.6524 151.1042
frequency: 36.6029 53.0952 151.0903 187.8248 255.4854 275.9835 313.6080 365.7898 463.7902 500.0696 525.6651 535.6159 624.5474 711.8254 763.3314 784.3384 953.7956 1114.4001 1158.4865 1172.1207 1217.6683 1237.3733 1298.2836 1880.6005
redmass: 17.4374 18.9184 18.0036 17.4362 18.0388 17.9747 18.1532 16.7270 16.9404 17.6028 17.8384 18.0893 16.7583 16.6236 17.6391 13.3476 14.1765 13.3152 13.1231 12.9966 12.9961 12.9587 12.3995 13.2839
irintensity: 0.5135 0.0253 0.9855 9.8800 0.4002 6.1394 0.6136 0.4706 8.8281 8.8386 11.7566 0.0143 4.0402 66.2250 0.3671 20.0667 251.0192 1.3060 77.8175 648.9391 469.9716 112.4691 203.2304 97.6512
temp: 298.150 k
press: 1.00000 atm
elementType: 6 6 6 8 9 9 9 9 9 9
symmnumber: 1
zpe: 99178.7 jmol-1
zpe.correction: 0.037775 hartree
zpe.thermalcorrener: 0.046656 hartree
zpe.thermalcorrenthalpy: 0.047600 hartree
zpe.thermalcorrgfe: 0.002216 hartree
zpe.sumelectzpe: -788.861309 hartree
zpe.sumelectthermal: -788.852429 hartree
zpe.sumelectthermalent: -788.851485 hartree
zpe.sumelectthermalfe: -788.896868 hartree
dipole: -0.2025 0.2680 0.1485
dipole: 0.3673
quadrupole: -56.9658 -55.4342 -53.1533
quadrupole: 2.6864 0.0644 -1.2721
quadrupole: -1.7814 -0.2497 2.0311 2.6864 0.0644 -1.2721
hfenergy: -788.8990846 hartree
pointgroup: C01 [X(C3F6O1)]
dipole: -0.0796887 0.1054263 0.0584185 debye
dipolederiv: 0.7088125 -0.204091 0.0983106 -0.19774 0.5860033 0.3488731 0.0873085 0.3400449 0.3814929 1.7691092 -0.0383168 -0.0794586 -0.0464784 1.68138 -0.1967947 -0.0785777 -0.2067222 1.6616829 1.5000968 0.0928675 -0.1030034 0.1020361 1.7930113 -0.0227343 -0.1061115 -0.0115908 1.8173209 -0.5896714 0.1953606 0.0225324 0.1919306 -0.610256 -0.2158928 0.0272213 -0.2149631 -0.4126095 -0.5186862 -0.2862456 -0.1730262 -0.2364938 -0.7752079 -0.2228551 -0.1492848 -0.2311475 -0.4222923 -0.629877 0.1289694 0.3067517 0.1056819 -0.3625814 -0.1516469 0.2389608 -0.1367061 -0.7215867 -0.4241887 0.0897743 -0.0853373 0.0322147 -0.645409 0.33366 -0.0641036 0.3457018 -0.6399938 -0.394977 0.1470474 -0.0727862 0.1961159 -0.9480705 0.0871153 -0.0543696 0.0347252 -0.3718175 -0.3690892 -0.0859751 0.116912 -0.0607364 -0.3946231 0.0739243 0.161202 0.112052 -0.9489037 -1.051529 -0.0393907 -0.030895 -0.0865307 -0.3242468 -0.0336489 -0.0622455 -0.0313942 -0.3432931 unknown
polarizability: 44.0905831|-2.7437295|43.0412421|0.7782087|4.1101172|40.4344991 unknown
InChI: InChI=1/C3F6O/c4-2(5,6)1(10)3(7,8)9
charge 0 multiplicity 1
10 atoms
C  4.82937502 -1.44079202 1.84332576
C  5.40952088 -0.42528546 2.87858512
C  3.33497156 -1.23068975 1.4401666
O  5.48709837 -2.31928387 1.38591887
F  2.83300308 -2.35197075 0.92974542
F  2.59934117 -0.86788169 2.5017894
F  3.25678621 -0.26006359 0.51476851
F  4.97142097 0.81683281 2.62293796
F  5.01417463 -0.77231378 4.11458174
F  6.73895883 -0.43189821 2.83597648
