program: Gaussian 16
title: Title CardRequired
version: ES64L-G16RevB.01
method: RB3LYP
basis: TZVP
operation: Freq
keyword: #P
keyword: Geom=AllCheck
keyword: Guess=TCheck
keyword: SCRF=Check
keyword: GenChk
keyword: RB3LYP/TZVP
keyword: Freq
title: Title Card Required
converged: YES YES YES YES
title: Mulliken charges:
elementType: C C C O F F F F H H
charge: 0.168049 0.238376 0.240691 -0.208943 -0.188819 -0.197589 -0.192828 -0.179858 0.161720 0.159199
chargesum: 0.00000
title: Mulliken charges with hydrogens summed into heavy atoms:
elementType: C C C O F F F F
charge: 0.168049 0.397576 0.402412 -0.208943 -0.188819 -0.197589 -0.192828 -0.179858
polarizability: 4.25458204e+01 -2.68053355e+00 4.31177320e+01 1.10998081e+00 3.73035629e+00 3.95705684e+01
1716.lowfreq: -0.0006 0.0006 0.0012 13.5955 18.7783 25.6360 40.7206 60.6729 169.6954
frequency: 37.9699 57.2093 169.6853 199.4233 276.3530 312.4318 417.2203 522.0138 589.3731 675.3224 732.4263 875.1750 1027.6381 1064.2104 1112.9722 1120.6445 1199.5229 1364.1845 1371.7168 1379.7400 1415.9833 1851.2699 3093.8254 3125.2479
redmass: 11.1498 12.3153 13.3652 13.4461 13.7601 14.7460 12.8729 10.6188 10.1311 6.3773 6.9575 6.6551 9.0547 7.8280 7.0123 6.3905 3.1827 1.2192 1.3203 1.1617 1.4834 12.2188 1.0874 1.0904
irintensity: 4.6583 1.8999 2.7471 11.6429 6.8624 2.9357 12.2858 39.5150 4.3820 62.9253 13.3931 45.9727 39.6408 380.7252 179.4643 79.7052 48.3364 7.0059 33.0511 22.4832 11.1032 112.0309 11.8140 10.4780
temp: 298.150 k
press: 1.00000 atm
elementType: 6 6 6 8 9 9 9 9 1 1
symmnumber: 1
zpe: 143501.4 jmol-1
zpe.correction: 0.054657 hartree
zpe.thermalcorrener: 0.062304 hartree
zpe.thermalcorrenthalpy: 0.063249 hartree
zpe.thermalcorrgfe: 0.020743 hartree
zpe.sumelectzpe: -590.276500 hartree
zpe.sumelectthermal: -590.268853 hartree
zpe.sumelectthermalent: -590.267909 hartree
zpe.sumelectthermalfe: -590.310414 hartree
dipole: 0.5637 0.8783 1.6943
dipole: 1.9899
quadrupole: -34.5360 -50.7834 -40.7898
quadrupole: 5.0899 7.7190 -1.8517
quadrupole: 7.5004 -8.7470 1.2466 5.0899 7.7190 -1.8517
hfenergy: -590.3311573 hartree
pointgroup: C01[X(C3H2F4O1)]
dipole: 0.2217919 0.3455307 0.6665892 debye
dipolederiv: 0.7359759 -0.2708598 0.0135159 -0.1788642 0.5886363 0.3639803 0.1584778 0.3391719 0.4225995 0.7329283 -0.1152584 -0.1773267 -0.0741183 1.3724134 -0.2561839 -0.1224225 -0.2653332 1.2890338 0.8300207 0.2332998 0.116939 0.2282907 1.4429489 -0.1556951 0.1869953 -0.1572666 1.0715092 -0.6785918 0.2107742 0.0302374 0.2127862 -0.6321569 -0.2067439 0.0295893 -0.2048791 -0.4466124 -0.3478829 0.2161332 -0.0662878 0.1132073 -0.9722262 0.0971482 -0.0249161 0.0529177 -0.3659481 -0.3608331 -0.0960942 0.2193694 -0.0386969 -0.3974767 0.0953981 0.1239135 0.1217623 -0.9380332 -0.3876369 0.0476878 -0.0572129 0.0451781 -0.649528 0.2760045 -0.1072378 0.3938195 -0.6157855 -0.4880145 -0.2617059 -0.1353793 -0.3074751 -0.7934522 -0.1749502 -0.2019912 -0.2593311 -0.4106104 0.0030562 0.0258412 0.0507823 0.0142364 0.0218282 -0.0236773 -0.0160001 -0.0042617 -0.0214174 -0.039022 0.0101819 0.0053627 -0.014544 0.0190132 -0.0152809 -0.0264082 -0.0165997 0.0152644 unknown
polarizability: 42.5458204|-2.6805335|43.117732|1.1099808|3.7303563|39.5705684 unknown
InChI: InChI=1/C3H2F4O/c4-2(5)1(8)3(6)7/h2-3H
charge 0 multiplicity 1
10 atoms
C  4.83342166 -1.42261664 1.83019841
C  5.41703468 -0.43282458 2.85294605
C  3.3401293 -1.22962094 1.4740266
O  5.50370291 -2.29890075 1.36530836
F  4.98075715 0.83188954 2.59199914
F  4.93696108 -0.7894836 4.08661265
F  3.26717714 -0.25081787 0.51779748
F  2.8487615 -2.37550293 0.9466468
H  2.72833425 -0.933531 2.32902469
H  6.5072848 -0.45408817 2.86666473
