program: Gaussian 09
title: 000061909
version: EM64L-G09RevD.01
frameworkgroup: C1[X(C19H24O4)]
method: RPBEPBE
basis: SDD
operation: Freq
keyword: #pfreq=noraman
keyword: PBEPBE/SDD
title: #p freq=noraman PBEPBE/SDD
converged: YES YES NO NO
title: Mulliken charges:
elementType: O O O O C C C C C C C C C C C C C C C C C C C H H H H H H H H H H H H H H H H H H H H H H H H
charge: -0.250121 -0.250104 -0.421206 -0.421226 0.030714 0.451380 0.451450 -0.756111 -0.756127 -0.433387 -0.433193 -0.363486 -0.363595 -0.380059 -0.380090 -0.390891 -0.390792 0.331387 0.331372 -0.276072 -0.276050 -0.334491 -0.334482 0.234359 0.229896 0.207571 0.234372 0.207621 0.229843 0.242346 0.242197 0.248003 0.248074 0.237998 0.238006 0.251377 0.251362 0.199566 0.207136 0.199581 0.207117 0.236352 0.180981 0.236343 0.180978 0.332050 0.332051
chargesum: 0.00000
title: Mulliken charges with hydrogens summed into heavy atoms:
elementType: O O O O C C C C C C C C C C C C C C C C C C C
charge: -0.250121 -0.250104 -0.089157 -0.089176 0.030714 0.451380 0.451450 -0.084286 -0.084291 -0.191041 -0.190996 -0.115482 -0.115521 -0.142061 -0.142084 -0.139514 -0.139431 0.331387 0.331372 0.130629 0.130649 0.082842 0.082839
polarizability: 3.11019996e+02 4.26494177e-02 1.97398150e+02 -2.26413156e+01 -2.19986993e-02 1.73974134e+02
1716.lowfreq: -8.3734 -2.3072 -0.0009 0.0003 0.0006 7.3691 19.8319 20.3403 36.2725
frequency: 19.4466 20.3340 36.2014 39.2088 49.4290 67.0901 72.7123 100.6350 105.7367 111.6975 134.9367 148.0122 158.3726 202.2550 203.7448 213.7419 227.9783 266.0378 277.1430 285.4116 290.4664 306.5021 322.9518 332.9197 334.7474 372.7562 410.0280 412.1180 422.7827 422.8836 464.4951 468.4128 473.9317 514.6178 548.0336 571.9927 583.2661 632.0297 633.1155 647.8784 729.9770 740.8374 742.1531 778.3608 800.1392 811.8003 812.9063 840.8408 842.1389 864.2052 864.4954 900.1645 900.9006 913.7198 930.4274 939.4922 942.0183 971.0129 973.2818 1000.1855 1001.7669 1006.9792 1017.4224 1017.7182 1036.0471 1036.4477 1083.2268 1083.2519 1087.0526 1108.9694 1112.0714 1124.6650 1156.6936 1167.8966 1167.9517 1183.1732 1186.0233 1225.9814 1226.9971 1229.8954 1245.8218 1254.1315 1254.2349 1307.5580 1308.1432 1320.1332 1320.1891 1361.4322 1364.2642 1375.1089 1376.4387 1377.8911 1390.7484 1390.9076 1395.5170 1416.0201 1417.1793 1454.3588 1454.3732 1463.1205 1465.5948 1467.0147 1472.6319 1483.7330 1487.5985 1500.1695 1501.2680 1578.7856 1581.5132 1621.8815 1623.9355 2924.7032 2924.7772 2948.9217 2949.0020 2975.7844 2979.3032 2986.7542 2986.7787 3071.1711 3073.8824 3082.6654 3084.2803 3091.9273 3091.9456 3126.9471 3127.2273 3139.4030 3139.4661 3160.2212 3160.3734 3164.8993 3164.9604 3557.4139 3557.4409
redmass: 3.8408 5.8815 3.3853 5.2990 6.3351 3.5010 3.8882 4.7611 3.2643 3.2914 3.0912 2.4260 5.0129 1.9258 3.5883 2.2937 3.0673 1.3044 1.9887 1.4094 2.6541 1.1898 2.7879 2.6051 3.0786 3.7858 2.9595 3.0331 3.9686 4.2013 3.2741 3.0465 3.5356 3.0477 2.5420 2.6519 3.4573 6.8704 6.5080 4.6304 3.4778 3.7620 3.0950 4.1265 2.7686 1.3822 1.4814 1.5312 1.5301 2.9098 2.8984 3.0736 3.0560 2.2304 1.4968 1.3520 1.4555 1.3502 1.3519 1.8194 2.9826 1.7601 1.8173 1.7948 2.2649 2.2850 2.9898 2.9872 2.0060 1.7800 2.1061 1.3543 2.1155 1.1809 1.1805 1.5063 1.4132 2.2780 2.3643 3.7310 3.2160 1.1449 1.1399 1.2801 1.3033 1.2647 1.2659 3.4207 2.6321 1.2631 1.4172 1.6995 1.2986 1.3115 1.2073 3.5925 3.6239 1.0801 1.0801 1.0768 1.1262 1.0997 1.0676 1.0776 1.0512 2.2029 2.3882 7.0006 7.0760 6.3146 6.3933 1.0567 1.0567 1.0706 1.0705 1.0348 1.0356 1.1037 1.1037 1.0996 1.0997 1.0998 1.0995 1.0927 1.0927 1.0887 1.0889 1.0864 1.0864 1.0946 1.0947 1.0956 1.0955 1.0663 1.0663
irintensity: 3.2118 0.0614 5.5616 0.5080 0.2071 3.3636 1.8570 1.2953 6.0900 9.5972 0.2862 48.5437 0.0024 9.6181 47.8591 119.0366 0.5354 6.9576 150.5606 5.7048 25.5613 11.8212 1.1254 14.2735 0.5767 0.2798 1.3582 0.0766 0.0197 2.2051 12.6933 2.9476 3.1048 0.2206 22.6525 25.3289 35.8322 0.0537 0.1325 6.4701 14.1761 2.1194 1.7372 2.8985 6.5510 18.6947 10.4201 53.1883 33.6241 2.6738 57.5112 134.7106 11.1945 4.2699 3.4637 0.1742 0.3963 0.0974 0.9540 0.0170 35.1607 6.3806 143.2402 0.4275 69.5059 0.2063 0.1389 22.1491 17.5520 15.3042 1.8346 5.8459 5.7779 53.6832 2.2775 291.8734 40.9878 27.4185 251.9994 46.1901 42.1111 30.3341 5.3790 0.5782 0.1800 2.7320 14.6465 15.0425 1.6215 43.0944 53.3446 2.5521 30.4612 2.8612 11.6418 11.0574 4.5562 6.0372 7.0940 19.7429 69.9253 17.2066 4.0553 1.2310 15.6586 207.2381 55.8132 13.9861 14.9844 71.0911 14.0032 32.6047 20.1057 217.0168 4.9138 26.2714 30.1224 50.5240 62.3498 7.2144 66.3816 43.7784 38.5481 16.4389 22.3924 0.6882 27.4974 19.2856 11.0862 34.6910 7.7146 3.4077 1.5932 8.0076 4.8605
temp: 298.150 k
press: 1.00000 atm
elementType: 8 8 8 8 6 6 6 6 6 6 6 6 6 6 6 6 6 6 6 6 6 6 6 1 1 1 1 1 1 1 1 1 1 1 1 1 1 1 1 1 1 1 1 1 1 1 1
symmnumber: 1
zpe: 1016630.2 jmol-1
zpe.correction: 0.387214 hartree
zpe.thermalcorrener: 0.411058 hartree
zpe.thermalcorrenthalpy: 0.412003 hartree
zpe.thermalcorrgfe: 0.331588 hartree
zpe.sumelectzpe: -1037.534913 hartree
zpe.sumelectthermal: -1037.511068 hartree
zpe.sumelectthermalent: -1037.510124 hartree
zpe.sumelectthermalfe: -1037.590538 hartree
dipole: 0.0009 4.1061 0.0041
dipole: 4.1061
quadrupole: -121.3396 -142.6585 -135.2934
quadrupole: 0.0471 -36.3297 -0.0058
quadrupole: 11.7576 -9.5614 -2.1962 0.0471 -36.3297 -0.0058
hfenergy: -1037.9221265 hartree
pointgroup: C01 [X(C19H24O4)]
dipole: -0.0056897 1.6154415 -0.0044784 debye
polarizability: 309.6602052|0.3643815|197.3988163|-26.399745|-0.2054041|175.3332589 unknown
InChI: InChI=1S/C19H24O4/c1-19(2,15-3-7-17(8-4-15)22-13-11-20)16-5-9-18(10-6-16)23-14-12-21/h3-10,20-21H,11-14H2,1-2H3
charge 0 multiplicity 1
47 atoms
O  -4.738967 -1.374092 -0.066662
O  4.74084 -1.336684 0.07753
O  -7.595008 -1.96095 -0.758794
O  7.601018 -1.9023 0.771888
C  -0.012158 2.002343 -0.007167
C  -1.275927 1.108798 0.064169
C  1.258274 1.117815 -0.071744
C  -0.155274 2.916475 -1.260708
C  0.123852 2.926992 1.23946
C  -2.311329 1.302086 1.006189
C  2.293382 1.313945 -1.013544
C  -1.449219 0.068699 -0.893996
C  1.438796 0.084959 0.892823
C  -3.481199 0.502921 1.006743
C  3.469621 0.524265 -1.007996
C  -2.601352 -0.732973 -0.91425
C  2.597336 -0.707318 0.919147
C  -3.628617 -0.517324 0.038779
C  3.623959 -0.489208 -0.033967
C  -5.845997 -1.165161 0.869596
C  5.846519 -1.125337 -0.859795
C  -6.950143 -2.169891 0.53853
C  6.957017 -2.12148 -0.524188
H  -1.095185 3.492114 -1.191718
H  -0.190324 2.326717 -2.194105
H  0.680106 3.637681 -1.330746
H  1.059808 3.508585 1.166656
H  -0.716573 3.642893 1.303452
H  0.162514 2.344512 2.177282
H  -2.223651 2.083732 1.767626
H  2.200414 2.090385 -1.77967
H  -0.656579 -0.123276 -1.626833
H  0.646844 -0.108993 1.625865
H  -4.251691 0.687858 1.761824
H  4.239589 0.711068 -1.763148
H  -2.730218 -1.530977 -1.651991
H  2.731618 -1.499946 1.661714
H  -6.221442 -0.120353 0.789343
H  -5.498475 -1.329544 1.912707
H  6.215337 -0.077789 -0.784632
H  5.499988 -1.296969 -1.902066
H  -6.523853 -3.184321 0.478773
H  -7.695951 -2.143643 1.364249
H  6.537103 -3.138258 -0.459428
H  7.702419 -2.094538 -1.350257
H  -7.885493 -1.016718 -0.835394
H  7.885567 -0.955899 0.843849
