program: Gaussian 16
title: Title Card Required
version: EM64L-G16RevB.01
method: RB3LYP
basis: TZVP
operation: Freq
keyword: #P
keyword: Geom=AllCheck
keyword: Guess=TCheck
keyword: SCRF=Check
keyword: GenChk
keyword: RB3LYP/TZVP
keyword: Freq
converged: YES YES YES YES
title: Mulliken charges:
elementType: C H H C H H C H H B C C H C C C H C H H C C H H H H H H H H H H C H H N O O
charge: -0.210366 0.124946 0.142175 -0.243964 0.131147 0.130825 -0.299684 0.153158 0.151693 -0.053436 -0.083576 -0.103480 0.146887 -0.282523 -0.284365 -0.285327 0.150524 -0.288144 0.124060 0.128467 -0.213092 -0.211393 0.128487 0.123720 0.128142 0.122649 0.122312 0.126525 0.135827 0.119757 0.135504 0.119167 -0.197953 0.171370 0.153950 0.192155 -0.202429 -0.203715
chargesum: -0.00000
title: Mulliken charges with hydrogens summed into heavy atoms:
elementType: C C C B C C C C C C C C C N O O
charge: 0.056755 0.018008 0.005167 -0.053436 0.063310 0.047043 -0.029996 -0.032158 -0.034536 -0.039306 0.042493 0.043278 0.127367 0.192155 -0.202429 -0.203715
chargesum: 0.00000
polarizability: 2.04234892e+02 1.15324932e+01 1.72921920e+02 5.26830059e+00 -1.53442140e+00 1.80527831e+02
1716.lowfreq: -26.6438 -7.8033 -0.0003 0.0004 0.0009 6.6796 27.8819 31.8242 49.5031
frequency: 23.9244 28.8291 49.0215 53.0938 69.4992 96.4634 120.8236 131.2275 145.0087 191.3920 224.0029 280.7831 310.9688 315.0319 339.2476 373.0328 411.5898 453.7889 480.4656 506.7086 513.7939 588.2123 636.0373 669.4241 737.2385 739.4704 754.3796 773.4152 781.3958 786.5126 823.4551 854.8338 867.5366 904.7955 916.8364 918.8924 920.3436 926.3758 1001.0797 1010.9563 1017.9449 1043.0464 1044.3587 1052.9825 1064.8350 1078.2078 1086.3211 1097.7281 1104.6173 1140.6677 1159.5062 1173.4634 1175.7413 1183.4189 1240.8559 1259.7308 1266.4195 1271.5096 1281.9327 1292.9832 1321.7001 1327.7754 1331.9278 1340.0654 1342.7796 1358.5755 1360.2868 1371.1882 1385.0483 1386.9210 1388.6854 1389.4664 1396.3990 1407.1811 1418.3205 1431.4823 1484.2567 1485.1120 1486.6036 1491.4757 1494.3479 1501.3722 1502.0869 1508.8889 1531.6625 1582.4027 2970.0788 2986.3588 2989.0407 2989.3656 2992.5438 2993.6003 3009.2299 3013.1307 3020.0743 3020.4898 3022.4401 3023.3460 3023.8317 3032.1710 3035.0856 3035.9345 3045.9164 3082.4602 3086.2067 3092.0243 3107.2479 3162.8873
redmass: 3.8168 9.6214 4.2828 4.5242 2.2605 2.2575 2.1115 5.7630 2.1882 3.6795 1.7044 3.1765 4.5827 2.8457 3.2929 1.6671 3.5475 2.0996 3.6327 3.4422 1.7074 4.4405 3.2014 4.3132 1.6322 1.5535 6.7365 3.1029 3.0941 1.2864 2.9835 1.3748 1.4777 2.2023 2.0360 2.3962 3.4198 2.4452 2.3984 1.7011 2.5969 1.4437 2.6670 2.8468 2.7066 1.9129 2.8281 2.9478 1.5533 1.7939 1.1145 1.4549 1.1117 1.3420 1.3971 1.3360 1.3014 1.4057 1.3933 1.2232 1.3415 1.1917 1.1643 1.6404 1.0643 1.3108 1.4153 1.5430 1.5026 1.3719 1.3960 1.5717 1.3735 1.5529 2.9248 1.2055 1.0818 1.0796 1.0722 1.0817 1.0832 1.0867 1.0903 1.0989 1.0853 8.2890 1.0618 1.0672 1.0932 1.0629 1.0624 1.0604 1.0781 1.0614 1.1003 1.0977 1.0815 1.1029 1.1023 1.0723 1.0737 1.0670 1.0968 1.0938 1.1001 1.0615 1.0876 1.1091
irintensity: 0.2243 0.1533 4.5287 1.8329 0.2345 0.0155 1.2851 3.0438 0.2872 0.8647 0.0621 2.0513 0.0250 0.5668 3.2512 0.2930 3.7574 0.3110 0.4090 1.4890 2.2868 0.7207 1.8925 19.1389 1.1911 15.1102 4.6339 0.0565 0.9001 0.2223 0.0299 0.0126 0.2766 5.6435 13.8110 6.2194 13.5783 0.0373 29.0191 0.0473 0.9608 0.4190 4.1877 12.9384 7.4920 15.2640 20.4295 0.2489 22.0688 6.7818 0.1731 17.7533 1.6858 14.7857 3.9875 3.5139 13.5515 61.5756 6.0177 2.1486 13.9720 12.0754 0.3292 17.9555 0.4915 0.2476 25.8416 84.5106 15.9570 0.7279 5.1507 7.1079 0.0642 39.7701 86.6954 1.1634 0.0563 9.2101 0.8562 0.5212 9.8760 5.9617 8.9802 10.9451 9.7874 368.5293 25.2909 6.1907 3.1021 40.0837 85.9055 1.8955 139.9765 30.1303 34.8127 117.9530 62.8086 25.3571 49.8951 114.9387 28.2944 27.5899 31.8511 49.1821 25.8798 11.1552 71.4492 5.6211
temp: 298.150 k
press: 1.00000 atm
elementType: 6 1 1 6 1 1 6 1 1 5 6 6 1 6 6 6 1 6 1 1 6 6 1 1 1 1 1 1 1 1 1 1 6 1 1 7 8 8
symmnumber: 1
zpe: 882399.3 jmol-1
zpe.correction: 0.336088 hartree
zpe.thermalcorrener: 0.352319 hartree
zpe.thermalcorrenthalpy: 0.353263 hartree
zpe.thermalcorrgfe: 0.289784 hartree
zpe.sumelectzpe: -700.452468 hartree
zpe.sumelectthermal: -700.436236 hartree
zpe.sumelectthermalent: -700.435292 hartree
zpe.sumelectthermalfe: -700.498772 hartree
dipole: -4.7605 -0.8405 0.5233
dipole: 4.8624
quadrupole: -121.2782 -100.8619 -101.8521
quadrupole: -8.4987 -1.0750 1.3238
quadrupole: -13.2808 7.1355 6.1453 -8.4987 -1.0750 1.3238
hfenergy: -700.7885557 hartree
pointgroup: C01 [X(C12H22B1N1O2)]
dipole: -1.8729356 -0.3306969 0.2058738 debye
polarizability: 204.2348916|11.5324932|172.9219198|5.2683006|-1.5344214|180.5278313 unknown
InChI: InChI=1/C12H22BNO2/c15-14(16)10-2-1-9-13-11-5-3-6-12(13)8-4-7-11/h11-12H,1-10H2
charge 0 multiplicity 1
38 atoms
C  0.84168886 0.70182099 0.0762788
H  1.34231078 -0.24616259 0.2956766
H  0.99637961 0.91486389 -0.98377073
C  -0.65439801 0.57958046 0.37255472
H  -1.14228959 1.53787297 0.1651648
H  -0.80000486 0.39023064 1.44133928
C  -1.33255343 -0.52661914 -0.43928273
H  -1.17247598 -0.35692335 -1.51569514
H  -0.8319143 -1.4903274 -0.25886113
B  -2.87145814 -0.76041802 -0.24396086
C  -3.64548423 -1.89942611 -1.00556319
C  -3.83400781 0.04695152 0.70288563
H  -2.99606918 -2.47375508 -1.67655108
C  -4.18946119 -2.88597967 0.06597891
C  -4.74010233 -1.22991285 -1.88070178
C  -4.36747902 -0.95370311 1.76802861
H  -3.33107664 0.85492922 1.24396621
C  -4.93607308 0.69947517 -0.17764473
H  -3.32997381 -3.40755439 0.50452271
H  -4.79472838 -3.66073914 -0.41864166
C  -5.0000524 -2.23777938 1.20275799
C  -5.67023156 -0.25866366 -1.13273854
H  -5.34080098 -2.00097166 -2.37684077
H  -4.23448505 -0.68048264 -2.68423506
H  -5.08928286 -0.44651483 2.41857796
H  -3.52631105 -1.23369542 2.41400666
H  -4.46084106 1.48833999 -0.773333
H  -5.6666367 1.2066523 0.46319502
H  -5.11324577 -2.96308178 2.01471521
H  -6.01151873 -2.02602603 0.85826665
H  -6.22852606 0.33253891 -1.86551759
H  -6.42127292 -0.82281751 -0.58097856
C  1.48348799 1.80972634 0.90411854
H  1.06330637 2.78506732 0.66094427
H  1.4162888 1.62245808 1.97248283
N  2.95617128 1.9121262 0.58776833
O  3.75627412 1.59003505 1.45628052
O  3.26078819 2.29445913 -0.53425153
