program: Gaussian 16
title: Title
version: EM64L-G16RevB.01
method: RB3LYP
basis: Gen
operation: Freq
keyword: #P
keyword: Geom=AllCheck
keyword: Guess=TCheck
keyword: SCRF=Check
keyword: GenChk
keyword: RB3LYP/ChkBas
keyword: Freq
converged: YES YES YES YES
title: Mulliken charges:
elementType: O C C H H H H C H H C C C C H H Cs N O O F F F F F F
charge: -0.630620 -0.329297 -0.200233 0.146555 0.143849 0.129240 0.120413 -0.226141 0.142700 0.130136 0.027185 0.424498 0.411744 -0.200937 0.173989 0.151397 0.870954 0.193069 -0.205828 -0.204369 -0.190415 -0.167198 -0.173189 -0.172468 -0.169932 -0.195101
chargesum: -0.00000
title: Mulliken charges with hydrogens summed into heavy atoms:
elementType: O C C C C C C C Cs N O O F F F F F F
charge: -0.630620 -0.038893 0.049420 0.046694 0.027185 0.424498 0.411744 0.124449 0.870954 0.193069 -0.205828 -0.204369 -0.190415 -0.167198 -0.173189 -0.172468 -0.169932 -0.195101
polarizability: 1.47309600e+02 -8.43638607e-01 1.18587666e+02 -8.60920057e+00 5.45533342e+00 1.58800840e+02
1716.lowfreq: -7.1833 -4.2963 -0.0007 -0.0003 0.0001 6.6851 14.0404 17.1622 21.3986
frequency: 13.6296 17.1315 21.2270 33.1687 42.7298 53.5458 58.7609 82.6024 93.6052 122.4141 130.5140 155.3458 178.3603 191.5196 240.1310 271.3235 296.6038 309.4891 325.3720 341.6872 372.6729 397.4382 471.4127 485.2679 517.8965 528.9237 551.5841 599.3285 645.7942 675.5840 708.1364 738.2783 752.3889 759.4937 803.4042 893.4797 918.0820 930.7061 985.6476 1030.2448 1049.1346 1061.7083 1080.1327 1093.3716 1121.8180 1125.6568 1153.8275 1184.5520 1212.2925 1224.9305 1246.0693 1277.3067 1295.1021 1329.4820 1347.4173 1351.6348 1374.7866 1402.8446 1417.9847 1478.8292 1482.6947 1496.0101 1514.2512 1580.1405 3034.1303 3040.7016 3047.7639 3070.8846 3084.6815 3091.4159 3099.8211 3162.8384
redmass: 13.3574 12.4862 18.0946 11.0725 9.5898 9.1220 5.4986 13.5540 3.3079 2.6048 5.0128 6.1786 5.4949 11.0139 6.0980 13.8935 10.8362 12.4657 6.7727 12.9156 5.6637 5.0955 6.6193 3.8712 16.1143 12.6423 16.4483 8.4254 5.4482 5.1599 13.6729 7.9213 1.5202 2.9215 1.3580 3.7889 4.3604 3.1016 2.7231 3.6699 3.2944 5.4562 12.7390 5.4467 2.4085 11.9611 7.8012 1.5114 5.3799 6.5377 3.5193 1.3460 1.3560 1.1288 1.3034 1.2048 1.7963 1.5791 3.2322 1.0852 1.0789 1.0870 1.0997 8.4683 1.0600 1.0590 1.0612 1.1006 1.1012 1.0611 1.1043 1.1088
irintensity: 0.8991 1.6842 3.7303 3.3701 4.8690 3.9002 3.1539 4.5903 3.9187 2.0762 5.8933 6.5978 13.0031 8.0084 4.7469 3.9971 3.7825 0.8960 3.6431 1.9615 29.1832 8.7715 1.7252 1.5283 6.1713 2.6583 0.8345 1.3937 48.4446 3.2064 26.5418 0.9232 5.0094 6.3049 0.4016 83.0767 39.7277 52.2857 127.4343 36.6372 15.8419 50.0263 7.4092 14.0524 196.6429 627.3079 236.7100 71.9736 186.2044 175.7403 133.3524 19.2765 37.0618 0.7673 2.7451 32.3131 43.5610 12.4500 81.0673 8.8033 6.2942 0.3898 14.5807 373.8552 2.3026 7.7668 54.0798 0.3849 2.8170 6.9437 50.2276 5.1419
temp: 298.150 k
press: 1.00000 atm
elementType: 8 6 6 1 1 1 1 6 1 1 6 6 6 6 1 1 55 7 8 8 9 9 9 9 9 9
symmnumber: 1
zpe: 432325.3 jmol-1
zpe.correction: 0.164664 hartree
zpe.thermalcorrener: 0.184004 hartree
zpe.thermalcorrenthalpy: 0.184948 hartree
zpe.thermalcorrgfe: 0.109659 hartree
zpe.sumelectzpe: -1171.478280 hartree
zpe.sumelectthermal: -1171.458940 hartree
zpe.sumelectthermalent: -1171.457996 hartree
zpe.sumelectthermalfe: -1171.533285 hartree
dipole: -1.1274 3.1594 14.4090
dipole: 14.7944
quadrupole: -144.9238 -120.2351 -154.7832
quadrupole: 1.9506 -0.0656 -7.8916
quadrupole: -4.9431 19.7456 -14.8025 1.9506 -0.0656 -7.8916
hfenergy: -1171.6429439 hartree
pointgroup: C01 [X(C7H8Cs1F6N1O3)]
dipole: -0.443572 1.2430212 5.6689518 debye
dipolederiv: -0.9051665 -0.0680803 -0.3354575 -0.0541965 -0.7088179 -0.1551859 -0.2560667 -0.1635812 -1.7583391 0.0268927 0.0086227 0.1181854 0.0395801 -0.0134866 -0.0723217 0.1325839 -0.0514634 -0.1449049 0.0971283 -0.0495048 0.0088642 -0.0799954 0.1262656 -0.028609 0.0269876 0.0026947 0.0931465 -0.046382 -0.043919 -0.0701064 -0.0344823 0.062266 -0.0005949 -0.0774659 -0.0379303 -0.1152278 0.0222351 0.0906893 -0.0013835 0.0499283 -0.0920924 0.0135111 -0.0152341 0.0256951 0.0629659 -0.0208045 -0.0345619 -0.0815017 -0.0135192 0.0306533 -0.0377834 -0.1105192 -0.057594 0.0195841 0.0184164 0.0536198 -0.0095287 0.0331593 -0.1143886 0.0738292 0.0014142 0.0888278 0.0077889 0.1576078 -0.0021677 0.0026888 0.0657845 0.0717948 -0.0882707 0.0409822 -0.0704673 0.1047451 -0.0120472 -0.0467929 -0.0477008 -0.0315835 0.0369351 -0.0192148 -0.0511229 -0.045038 -0.0568808 -0.009066 0.058905 0.0027332 0.0437946 -0.0895352 0.0520903 -0.0106906 0.0800655 0.0276641 0.6022328 0.0713302 0.4855351 -0.0212139 0.3492656 0.1459234 0.1717707 0.1053215 1.0102331 1.614731 -0.0431878 -0.0680253 0.0312489 1.5508626 -0.0461179 0.030584 0.0454823 1.7397506 1.6622617 0.0214162 -0.1274403 0.024284 1.5063354 0.080545 -0.0334082 0.0259469 1.6954931 0.080602 0.0512625 0.0939703 0.0036561 0.2153898 -0.0330202 0.0463873 -0.0341419 0.1520486 0.0744426 0.0415075 -0.0060662 0.0332118 -0.000674 0.0112318 0.0226687 0.0667304 -0.0053469 -0.0097532 -0.030581 -0.0359177 0.0178138 0.0608386 -0.0287856 -0.0109881 -0.0509405 -0.0029591 0.8354114 0.0043854 -0.012013 0.0112946 0.8569549 0.0935817 0.0246865 0.089379 1.4191487 1.5373142 -0.2512101 0.4154047 -0.4332376 0.3152585 0.4092634 0.4275626 0.2457972 1.3633231 -1.188425 0.1012924 -0.3027923 0.3319614 -0.323084 -0.0572148 -0.0861964 -0.0770476 -0.5786041 -0.6737938 0.0723233 -0.1132021 0.010569 -0.3354154 -0.2673986 -0.3644122 -0.1155905 -1.0771495 -0.6404172 0.1688476 0.3825456 0.2570517 -0.4727373 -0.239028 0.3403008 -0.1256182 -0.8200722 -0.8698081 -0.1867275 -0.3962987 -0.2542367 -0.4282992 -0.1180513 -0.3220338 -0.0565198 -0.6296322 -0.5819732 -0.1930475 0.1036047 -0.3189074 -0.8461724 0.1371496 0.1050704 0.091307 -0.3562136 -0.4743821 0.1488967 0.0328892 0.2361986 -0.9600603 0.0763009 -0.0020175 0.1200899 -0.3486984 -0.7125396 0.0572371 -0.4214538 0.1427536 -0.4036209 0.0962637 -0.3939495 0.0081969 -0.7921848 -0.5847174 -0.0005552 0.3824667 -0.0909179 -0.3944359 0.0019067 0.3631062 -0.1096016 -1.0096783 unknown
polarizability: 147.3095999|-0.8436386|118.5876656|-8.6092006|5.4553334|158.8008404 unknown
InChI: InChI=1/C7H8F6NO3.Cs/c8-6(9,10)5(15,7(11,12)13)3-1-2-4-14(16)17;/h1-4H2;/q-1;+1/rC7H8CsF6NO3/c8-18-5(6(9,10)11,7(12,13)14)3-1-2-4-15(16)17/h1-4H2
charge 0 multiplicity 1
26 atoms
O  -1.22923589 -0.05902377 -1.23394801
C  -1.37871456 -0.6879765 -3.59518288
C  -0.22601689 0.2153938 -4.0364196
H  -2.11441812 -0.79041581 -4.39773986
H  -0.97531811 -1.68309512 -3.39808523
H  0.3660443 0.47101741 -3.1546478
H  -0.60881243 1.15160109 -4.45004067
C  0.65812047 -0.46992917 -5.08286089
H  0.06460331 -0.76268678 -5.95189051
H  1.09399216 -1.38027324 -4.66081641
C  -2.06116639 -0.24734647 -2.25610924
C  -3.0852047 -1.39488438 -1.89093078
C  -2.89707858 1.06668751 -2.50763847
C  1.7812737 0.45685919 -5.53839532
H  1.39140843 1.3352055 -6.052099
H  2.4306119 0.75378756 -4.71930882
Cs -1.66593093 0.36884654 1.47292022
N  2.67183044 -0.2374148 -6.54086741
O  3.81641722 -0.50984257 -6.20135822
O  2.18942043 -0.502677 -7.63387067
F  -3.64643571 1.41330799 -1.42273288
F  -4.08403564 -1.59522202 -2.7847828
F  -2.07913676 2.11793615 -2.73412636
F  -2.44573472 -2.57866671 -1.75928273
F  -3.75420248 1.01704766 -3.55798281
F  -3.69149019 -1.1742671 -0.68829464
