program: Gaussian 09
title: 000061900
version: EM64L-G09RevD.01
frameworkgroup: C1[X(C10H23O5P)]
method: RPBEPBE
basis: SDD
operation: Freq
keyword: #p
keyword: freq=noraman
keyword: PBEPBE/SDD
title: #p freq=noraman PBEPBE/SDD
converged: YES YES NO NO
title: Mulliken charges:
elementType: P O O O O O C C C C C C C C C C H H H H H H H H H H H H H H H H H H H H H H H
charge: 1.376296 -0.370749 -0.498274 -0.709959 -0.671933 -0.603250 -0.377080 -0.372021 -0.375051 -0.353111 -0.406353 -0.356410 -0.254049 -0.695223 -0.198967 -0.344922 0.195762 0.201477 0.188725 0.191076 0.196108 0.192169 0.188903 0.191208 0.220046 0.230589 0.194083 0.195538 0.210494 0.214353 0.209850 0.215872 0.211270 0.226738 0.210220 0.236293 0.252613 0.445201 0.392466
chargesum: 0.00000
title: Mulliken charges with hydrogens summed into heavy atoms:
elementType: P O O O O O C C C C C C C C C C
charge: 1.376296 -0.370749 -0.498274 -0.264759 -0.279467 -0.603250 0.020159 0.007779 0.013226 0.026999 0.044282 0.033211 0.170799 -0.058230 0.237992 0.143985
polarizability: 1.85870734e+02 7.97138926e-01 1.46919183e+02 -5.69099818e-01 2.57208260e+00 1.22369336e+02
1716.lowfreq: -6.4734 -4.4400 -0.0018 -0.0010 0.0004 5.7399 16.7784 21.7153 29.3729
frequency: 16.2876 21.6521 29.2881 34.5698 46.7458 69.0513 76.3038 85.3965 111.2947 120.3748 135.4584 143.0332 163.1937 194.8746 206.8019 214.0779 229.7734 247.0846 249.6737 293.5073 302.6510 332.6969 348.2427 374.1243 394.0434 421.4891 447.7713 491.4517 520.2771 590.4415 694.5945 722.2043 730.4414 753.9057 791.7308 798.6680 823.1063 860.9040 868.9985 878.9923 888.8612 939.1834 975.0727 991.9626 1005.3110 1010.3570 1016.3595 1024.6268 1041.8895 1055.6427 1077.3136 1077.8968 1081.1534 1097.4050 1105.1060 1127.6178 1154.9796 1188.9451 1207.2605 1220.2878 1224.7489 1251.5638 1260.1920 1265.1551 1281.4344 1283.6991 1292.6226 1294.8096 1302.1785 1328.5671 1346.0720 1353.3872 1355.4438 1356.4775 1384.0904 1389.3529 1399.8217 1454.8107 1456.0661 1461.2026 1461.8221 1466.7422 1471.0464 1476.0125 1476.9856 1481.7625 1487.6978 1491.0491 2641.9019 2950.2656 2952.6414 2954.2023 2956.9059 2963.5612 2968.2086 2970.7061 2972.1044 2985.8052 2989.7070 2994.8518 3002.8716 3005.0567 3011.6381 3024.0412 3036.2683 3039.0039 3060.9844 3068.6659 3071.2822 3083.5864 3593.5139
redmass: 6.2608 6.3697 4.1011 1.7066 4.3040 2.1655 2.5792 3.3606 1.9159 2.8358 2.7251 1.9807 4.8934 4.2803 3.4456 3.6094 1.1131 4.8463 2.4681 3.0601 2.0700 3.9215 7.0964 5.1275 3.6191 5.0652 3.2874 3.0810 2.8819 6.8740 11.6546 1.0622 1.0824 1.1107 6.8552 1.1678 2.1818 1.2819 2.0866 1.4330 1.8706 1.1940 5.2998 4.2977 1.6518 1.2428 1.9110 3.7749 3.0489 3.4787 2.5179 2.5468 2.2351 3.5945 2.4857 2.9612 1.4706 1.6239 1.1244 1.2837 1.3681 1.1465 1.2547 1.2715 1.0361 1.1496 1.0881 1.1232 1.2711 1.3127 1.3785 1.4386 1.5571 1.4491 1.2110 1.2163 1.3008 1.0823 1.0821 1.0718 1.0743 1.0709 1.0781 1.0734 1.0466 1.0813 1.0866 1.0958 1.0750 1.0588 1.0569 1.0587 1.0582 1.0594 1.0590 1.0563 1.0363 1.0968 1.0594 1.0989 1.0643 1.1020 1.1058 1.1048 1.1043 1.1050 1.1055 1.1007 1.0994 1.1040 1.0660
irintensity: 2.4527 1.8382 0.3268 0.3620 1.1206 0.3767 0.3657 1.4588 0.8280 1.0981 0.2739 0.0919 1.4874 3.8265 19.6807 6.0197 0.1960 14.1339 21.8697 4.0186 87.1261 65.6485 17.5290 14.2532 0.4263 8.6151 4.0875 0.5390 25.1340 41.1432 178.2191 14.1127 0.2300 4.7987 167.5432 1.4777 57.2268 11.0086 72.4588 131.7210 1.9944 1.1328 131.5393 1.5598 27.0810 1.2127 26.2398 14.1616 31.6027 63.6092 20.3567 15.0922 8.7595 185.7392 22.7920 4.0963 0.7280 0.2233 4.2626 12.1551 1.0619 11.1205 1.0457 1.2856 0.5290 0.3514 0.4575 0.0147 1.0509 2.6683 12.0961 0.4505 0.2257 11.8474 60.8844 10.1788 33.8175 16.0950 1.4653 0.0319 0.0728 0.4527 0.3096 6.0287 10.6408 0.5738 10.5267 26.7112 1892.1014 0.6223 2.4268 7.7815 9.4727 5.5171 154.1078 48.7824 35.0399 1.1485 38.9068 1.1732 12.7810 3.0605 19.5382 2.5260 32.3480 94.2254 88.4374 98.4911 55.0946 14.3199 59.7628
temp: 298.150 k
press: 1.00000 atm
elementType: 15 8 8 8 8 8 6 6 6 6 6 6 6 6 6 6 1 1 1 1 1 1 1 1 1 1 1 1 1 1 1 1 1 1 1 1 1 1 1
symmnumber: 1
zpe: 861161.7 jmol-1
zpe.correction: 0.327999 hartree
zpe.thermalcorrener: 0.349142 hartree
zpe.thermalcorrenthalpy: 0.350087 hartree
zpe.thermalcorrgfe: 0.273943 hartree
zpe.sumelectzpe: -1110.849100 hartree
zpe.sumelectthermal: -1110.827957 hartree
zpe.sumelectthermalent: -1110.827013 hartree
zpe.sumelectthermalfe: -1110.903157 hartree
dipole: 2.5536 6.4084 1.5859
dipole: 7.0784
quadrupole: -106.4050 -104.5228 -113.9081
quadrupole: -14.7055 -12.3145 -4.3775
quadrupole: 1.8736 3.7558 -5.6295 -14.7055 -12.3145 -4.3775
hfenergy: -1111.1770996 hartree
pointgroup: C01 [X(C10H23O5P1)]
dipole: 1.0827218 -2.479705 -0.6588676 debye
polarizability: 185.8691259|0.6834625|146.8870664|-0.848736|2.6975766|122.4030607 unknown
InChI: InChI=1S/C10H23O5P/c1-2-3-4-5-6-7-8-14-9-10-15-16(11,12)13/h11-12H,2-10H2,1H3
charge 0 multiplicity 1
39 atoms
P  -4.069912 1.168828 0.291881
O  -1.668929 -1.308184 -0.254492
O  -4.430806 -0.487425 0.754354
O  -2.502806 1.09575 -0.302014
O  -4.964793 1.372467 -1.179193
O  -4.442159 2.187529 1.439843
C  3.139505 0.109758 -0.299525
C  4.575989 -0.147723 0.207601
C  2.115942 -0.924546 0.221411
C  5.598656 0.888492 -0.310799
C  0.680964 -0.640465 -0.281771
C  7.036436 0.636036 0.197319
C  -0.320109 -1.674851 0.238753
C  8.050144 1.678449 -0.322161
C  -2.750317 -2.218169 0.172925
C  -4.099605 -1.589935 -0.176176
H  3.134604 0.103503 -1.409261
H  2.818846 1.126758 0.006981
H  4.898501 -1.16512 -0.09899
H  4.580454 -0.141324 1.317838
H  2.129061 -0.921785 1.331159
H  2.430821 -1.940998 -0.095027
H  5.59725 0.883172 -1.421024
H  5.277119 1.906207 -0.005402
H  0.661522 -0.642266 -1.388363
H  0.365085 0.369461 0.045335
H  7.358745 -0.380058 -0.110087
H  7.036458 0.639467 1.306602
H  -0.080979 -2.69199 -0.133048
H  -0.3401 -1.694124 1.348925
H  8.085492 1.679564 -1.428097
H  9.071003 1.471621 0.048436
H  7.772352 2.698437 0.004347
H  -2.686641 -2.385139 1.26699
H  -2.63097 -3.185764 -0.356166
H  -4.896193 -2.339087 -0.029276
H  -4.120787 -1.247658 -1.22929
H  -2.063301 0.147496 -0.305427
H  -5.802242 1.888317 -1.056212
