program: Gaussian 16
title: TitleCard Required
version: ES64L-G16RevB.01
method: RB3LYP
basis: TZVP
operation: Freq
keyword: #P
keyword: Geom=AllCheck
keyword: Guess=TCheck
keyword: SCRF=Check
keyword: GenChk
keyword: RB3LYP/TZVP
keyword: Freq
title: Title Card Required
converged: YES YES NO YES
title: Mulliken charges:
elementType: Cu N N C H C C H C H C C C H H H C H C H C H C C H C H H H C H H H C C C H C H C H C C H C H H H C H H H C H C H H H C H H H C H H H C H O H C H H C H H C C C C H H O H H H H H H H
charge: -0.064924 0.026340 0.014554 -0.190216 0.173504 0.060001 -0.050853 0.146064 -0.025590 0.150612 -0.205503 0.229887 -0.394601 0.131661 0.117548 0.129097 -0.251915 0.128543 0.007753 0.121210 -0.258532 0.127161 0.203283 -0.139238 0.142261 -0.377066 0.133880 0.128272 0.119468 -0.378378 0.126689 0.132568 0.134191 -0.198871 0.207466 -0.279333 0.126891 0.039349 0.100539 -0.210749 0.129536 0.175120 -0.159440 0.156877 -0.379838 0.125656 0.135227 0.126418 -0.406552 0.143437 0.137344 0.146899 -0.190735 0.184453 -0.388344 0.126199 0.133738 0.125807 -0.401107 0.129621 0.141138 0.133385 -0.431746 0.203224 0.130669 0.128313 -0.267770 0.046460 -0.472204 0.083226 -0.167982 0.118913 0.118108 -0.246335 0.128320 0.134450 -0.130682 0.215800 -0.372447 -0.364474 0.099493 0.110040 -0.401316 0.268378 0.102864 0.104566 0.090915 0.094167 0.109575 0.109617
chargesum: -0.00000
title: Mulliken charges with hydrogens summed into heavy atoms:
elementType: Cu N N C C C C C C C C C C C C C C C C C C C C C C C C C C C C O C C C C C C O
charge: -0.064924 0.026340 0.014554 -0.016712 0.060001 0.095211 0.125022 -0.205503 0.229887 -0.016295 -0.123372 0.128963 -0.131372 0.203283 0.003023 0.004554 0.015070 -0.198871 0.207466 -0.152442 0.139888 -0.081213 0.175120 -0.002563 0.007463 0.021128 -0.006282 -0.002600 0.003037 0.030460 -0.138084 -0.472204 0.069039 0.016434 0.078851 0.215800 -0.064140 -0.061078 -0.132938
polarizability: 5.25668970e+02 -1.90625747e+01 5.56570500e+02 -1.96109183e+01 -2.56181430e+00 4.81855699e+02
1716.lowfreq: -452.2922 -6.8022 0.0047 0.0053 0.0059 5.6179 10.1743 16.1939 23.8844
redmass: 4.4222 5.1860 4.6251 4.0603 4.3516 4.2418 4.2187 4.4146 4.2574 3.6554 3.3012 3.6062 3.4129 3.3417 3.3048 3.2272 3.5130 2.2861 2.8259 5.2543 4.6980 5.8001 3.1873 2.9514 3.2079 4.6021 3.6306 3.4529 3.4081 2.5573 2.0171 2.7587 1.2225 1.2242 1.1244 1.1167 1.1221 1.3001 2.4007 1.8695 1.5793 1.5026 2.1842 1.6746 1.0899 1.3054 1.9644 1.6976 1.7194 2.9570 2.9571 3.6834 3.3539 3.1413 3.3416 5.2500 2.6667 4.7423 3.2937 3.0311 3.0616 2.5601 2.9470 3.1091 3.5465 3.7162 3.4701 2.8560 4.4620 4.8199 3.9680 3.2430 2.9659 3.1209 3.0101 3.6497 4.1489 3.2758 4.3711 3.0270 1.9620 5.2617 1.6750 3.2556 3.8021 2.9032 1.1854 1.7224 1.9558 3.6205 3.7418 1.4161 1.3861 1.4553 1.3911 2.5527 2.5907 1.2430 1.4011 1.4030 1.4739 1.3302 1.7419 1.3196 1.3238 1.4737 1.4639 1.4886 1.8643 2.6947 1.4928 1.4598 1.4665 1.3467 1.3128 4.3393 3.2145 3.4116 1.6116 2.3204 1.9864 1.9857 1.5090 1.8955 1.5161 1.7042 1.7785 2.3977 2.3559 2.3568 2.3100 2.3343 2.2841 1.5857 1.6322 1.7421 2.0551 2.0355 1.7583 1.7992 2.7176 1.3149 1.2822 1.1872 2.6120 1.2602 2.9705 3.3753 2.1727 2.1586 3.9410 3.4741 3.5846 1.1563 1.2862 1.0716 1.7202 1.6173 1.3190 1.5138 1.3442 3.2058 1.7139 1.2994 1.3303 1.2705 1.4406 1.4045 1.2481 2.1952 1.2176 1.2773 1.2883 1.2184 1.2180 1.2190 1.2167 1.2760 3.2113 2.3548 1.3950 1.0545 1.0569 1.0488 1.1010 1.1547 1.1067 1.1646 1.1046 1.1667 1.1751 1.1250 1.3074 1.2267 1.3631 1.4507 1.4242 1.1496 1.0808 1.0777 1.1463 1.1078 1.2779 1.1118 1.1233 1.3476 1.2667 1.0874 4.9089 5.9946 5.7318 5.6123 5.6580 1.0712 1.0568 1.0483 1.0385 1.1056 1.0391 1.0854 1.0353 1.0348 1.0351 1.0358 1.0362 1.0353 1.0473 1.0386 1.0419 1.0846 1.0967 1.0852 1.0956 1.0868 1.0872 1.1048 1.1025 1.1024 1.1017 1.1022 1.1025 1.1025 1.1032 1.1023 1.1022 1.1028 1.1026 1.1014 1.1018 1.1002 1.0991 1.0983 1.0991 1.1000 1.1175 1.0873 1.0872 1.0914 1.0909 1.0944 1.0948 1.0922 1.1105 1.0666
irintensity: 1083.3397 1.5599 2.5487 0.6506 1.0830 0.1003 1.1009 7.1040 1.5218 1.3240 1.7429 1.1378 1.4578 1.9212 0.1797 1.7491 0.4302 9.4758 2.7114 1.8972 5.6495 4.1000 0.0227 3.3810 0.3412 6.2380 1.9519 0.9457 7.2075 0.3449 17.9981 6.9023 93.6172 6.8760 0.5621 3.5654 1.4716 0.4360 2.7616 1.2150 0.4765 0.9690 64.4727 2.1474 0.3330 5.7926 2.0097 12.8607 2.6144 0.4247 0.5684 5.9258 13.2732 0.5310 34.7476 5.9629 9.0559 0.7018 2.7488 0.9739 6.3852 0.3198 31.3723 14.5431 12.0970 0.2470 13.7874 10.9344 0.2261 0.5774 3.3324 0.0144 0.0661 0.0140 0.5164 4.8400 0.6424 5.7015 0.0809 22.0632 90.3782 0.5445 37.3114 14.7063 12.6707 26.0380 5.1501 39.1266 28.6388 1.4082 2.6933 22.6878 0.5345 22.7262 32.6594 1.7264 0.3165 4.3412 1.0870 2.9088 2.9815 1.5962 5.1145 11.0503 2.3568 7.8985 6.7151 1.6885 5.4406 10.4040 0.8246 1.3927 1.6452 5.3994 0.3448 0.3885 11.6117 77.3447 16.1810 0.9265 7.9230 1.2857 2.0264 11.3650 20.5649 10.2335 87.6471 2.8537 2.0520 4.0907 3.9874 6.1879 5.7245 4.3478 11.5717 1.0063 0.3988 1.2142 1.4595 3.5451 48.9124 7.5392 4.1623 11.6302 23.3094 27.5529 1.6087 2.7624 0.9952 7.7955 17.0458 0.1961 8.8608 0.7584 21.5267 0.8299 1.3945 3.9632 0.7326 0.7892 0.7526 24.7478 33.2275 28.1433 28.5676 8.8994 2.8280 8.8237 21.9286 3.0348 1.9463 5.0464 4.4004 17.7136 4.3909 6.2015 3.4551 16.6735 79.0878 213.2586 5.8747 0.0604 0.8040 1.8506 14.3937 41.7422 2.2551 12.1328 5.0016 1.2216 3.6421 4.0615 1.4985 12.8208 1.7141 3.3473 15.2581 36.7792 1.3612 6.1568 16.4178 7.1254 35.6334 29.2392 5.8071 7.8619 25.8043 4.1547 2.4914 3.5001 5.5044 2.6947 6.5814 47.3236 68.0538 22.6062 30.7068 54.2845 126.0374 34.0503 12.2194 17.3260 32.8977 35.0805 32.5316 32.6833 23.2023 32.4363 58.2182 2.6531 4.9381 1.9458 104.5351 0.2304 0.5697 51.1692 26.7926 2.8209 22.4239 14.1411 7.6716 6.5176 10.8870 35.7718 81.9817 32.3473 27.9160 36.8468 64.2354 44.5532 13.9925 169.7846 34.8312 38.7996 3.7113 4.4604 2.4066 9.7241 11.1622 15.0142 14.0120 10.9943 3.6972 39.9347
temp: 298.150 k
press: 1.00000 atm
elementType: 29 7 7 6 1 6 6 1 6 1 6 6 6 1 1 1 6 1 6 1 6 1 6 6 1 6 1 1 1 6 1 1 1 6 6 6 1 6 1 6 1 6 6 1 6 1 1 1 6 1 1 1 6 1 6 1 1 1 6 1 1 1 6 1 1 1 6 1 8 1 6 1 1 6 1 1 6 6 6 6 1 1 8 1 1 1 1 1 1 1
symmnumber: 1
zpe: 2054555.3 jmol-1
zpe.correction: 0.782539 hartree
zpe.thermalcorrener: 0.827184 hartree
zpe.thermalcorrenthalpy: 0.828128 hartree
zpe.thermalcorrgfe: 0.703290 hartree
zpe.sumelectzpe: -3226.728322 hartree
zpe.sumelectthermal: -3226.683677 hartree
zpe.sumelectthermalent: -3226.682733 hartree
zpe.sumelectthermalfe: -3226.807571 hartree
dipole: 6.2555 9.7284 4.6521
dipole: 12.4666
quadrupole: -205.8217 -275.0812 -200.7870
quadrupole: -1.2311 41.4671 25.6371
quadrupole: 21.4083 -47.8512 26.4430 -1.2311 41.4671 25.6371
hfenergy: -3227.5108609 hartree
pointgroup: C01 [X(C34H51Cu1N2O2)]
dipole: 2.4611039 3.8274559 1.8302952 debye
polarizability: 525.6689699|-19.0625747|556.5705005|-19.6109183|-2.5618143|481.8556992 unknown
InChI: InChI=1/C27H36N2.C4H9O.C3H6O.Cu/c1-18(2)22-11-9-12-23(19(3)4)26(22)28-15-16-29(17-28)27-24(20(5)6)13-10-14-25(27)21(7)8;1-2-3-4-5;1-3(2)4;/h9-16,18-21H,1-8H3;5H,1-4H2;1-2H3;/rC31H45CuN2O.C3H6O/c1-21(2)25-13-11-14-26(22(3)4)29(25)33-18-19-34(31(33)32-17-9-10-20-35)30-27(23(5)6)15-12-16-28(30)24(7)8;1-3(2)4/h11-16,18-19,21-24,35H,9-10,17,20H2,1-8H3;1-2H3
charge 0 multiplicity 1
90 atoms
Cu 2.26725722 -1.0276704 4.29631198
N  3.51010488 0.81954854 6.20658161
N  4.66822935 -0.97441948 6.05982216
C  3.32538976 -3.30951447 7.1741143
H  3.09976025 -2.25467732 7.32962002
C  3.56140884 -0.37209085 5.56027101
C  4.56379429 0.95978512 7.09768775
H  4.687951 1.8399336 7.70299773
C  5.29207664 -0.17746087 7.00964824
H  6.18471162 -0.49190381 7.5205032
C  5.11785016 -2.2825192 5.65476215
C  4.4900816 -3.40813597 6.20179302
C  3.68227442 -3.90480171 8.5434293
H  2.84676068 -3.78456766 9.23780167
H  4.55692172 -3.41327109 8.97702613
H  3.90044517 -4.97277047 8.46943932
C  4.95462281 -4.66016568 5.79286641
H  4.48827115 -5.55421731 6.18604943
C  5.98822282 -4.77392912 4.87724981
H  6.3297875 -5.75505213 4.56977797
C  6.57530732 -3.63776801 4.33290216
H  7.36369934 -3.74871334 3.60069326
C  6.14756063 -2.36443421 4.7032995
C  6.69833205 -1.11649012 4.0277498
H  6.58983005 -0.28028545 4.72049146
C  5.85791654 -0.79181709 2.7799987
H  5.94919143 -1.5887878 2.03789705
H  6.1936454 0.14181277 2.32149544
H  4.80006875 -0.69044823 3.02856247
C  8.18554561 -1.21185414 3.67269853
H  8.37184987 -1.94010196 2.8805163
H  8.78879211 -1.49218677 4.53911769
H  8.54278073 -0.2449462 3.31066557
C  2.45614963 1.77623503 5.98787749
C  2.56344437 2.65473313 4.90210424
C  1.49946204 3.53081004 4.67893316
H  1.54100492 4.21686927 3.84233892
C  0.38100864 3.5178104 5.49808582
H  -0.44720775 4.18361907 5.29305993
C  0.29923238 2.62912144 6.56097183
H  -0.5975311 2.60878825 7.16502619
C  1.33394114 1.73488349 6.82958339
C  1.19383692 0.69566754 7.93211329
H  2.18065805 0.27712217 8.13363538
C  0.67894754 1.29033098 9.24837847
H  1.29801914 2.12810672 9.5776066
H  0.69333325 0.52957719 10.03243342
H  -0.34971516 1.64594307 9.1598983
C  0.29497284 -0.45810846 7.45825776
H  -0.71354799 -0.10144884 7.2372419
H  0.22378236 -1.22997359 8.2284184
H  0.68920532 -0.92050462 6.55167925
C  3.74940893 2.63381042 3.95037216
H  4.50162011 1.95792416 4.35781552
C  4.40425885 4.01430078 3.81100389
H  3.72767767 4.73868389 3.3522527
H  5.29321524 3.94821589 3.1789421
H  4.70834988 4.40937861 4.78300128
C  3.32757461 2.07732232 2.58180788
H  2.91110221 1.07188611 2.67842503
H  4.18391421 2.02435299 1.90585657
H  2.56811328 2.71011595 2.11666019
C  2.06517983 -3.96514075 6.58899894
H  1.82820482 -3.59532347 5.58867499
H  1.20656957 -3.77766705 7.23862763
H  2.18377622 -5.04742827 6.50180528
C  0.72837325 -1.62274954 2.98562208
H  0.542573 -1.94439545 4.01387228
O  0.91474026 -4.23451789 3.14849901
H  1.6824909 -1.86708204 2.5157019
C  -0.03118946 -0.40075521 2.49782974
H  0.63782423 0.31035519 2.00077799
H  -0.75657666 -0.70527505 1.72968608
C  -0.79124694 0.31986153 3.61625127
H  -1.44096897 -0.39415266 4.13090192
H  -0.08391469 0.69718382 4.36027981
C  -1.63961978 1.4683413 3.10953071
C  0.13186217 -3.45804889 2.51521528
C  -1.33393668 -3.40911581 2.973288
C  0.25817108 -3.42598912 0.98505347
H  -0.99662081 2.23960318 2.66385316
H  -2.32162994 1.10842016 2.32788112
O  -2.38770957 2.01407877 4.2077617
H  -2.98293302 2.68717762 3.85972656
H  1.31264201 -3.39354662 0.70481365
H  -1.37663655 -3.36046967 4.06273289
H  -0.26519191 -2.58531004 0.52155614
H  -1.89664736 -2.57208253 2.55134131
H  -1.82711654 -4.3376873 2.66246158
H  -0.16592856 -4.35245069 0.58019235
