program: Gaussian 16
title: Title
version: EM64L-G16RevB.01
method: RB3LYP
basis: Gen
operation: Freq
keyword: #P
keyword: Geom=AllCheck
keyword: Guess=TCheck
keyword: SCRF=Check
keyword: GenChk
keyword: RB3LYP/ChkBas
keyword: Freq
converged: YES YES YES YES
title: Mulliken charges:
elementType: O C C H H H H C H H C C C H H C H H Cs O H F F F F
charge: -0.656438 -0.295359 -0.233490 0.113234 0.129795 0.101391 0.104777 -0.151115 0.104370 0.112960 0.143556 0.229959 0.202936 0.120356 0.140860 -0.135047 0.099333 0.094097 0.845125 -0.389677 0.269443 -0.245252 -0.241761 -0.244930 -0.219122
chargesum: -0.00000
title: Mulliken charges with hydrogens summed into heavy atoms:
elementType: O C C C C C C C Cs O F F F F
charge: -0.656438 -0.052330 -0.027323 0.066216 0.143556 0.350314 0.343796 0.058383 0.845125 -0.120234 -0.245252 -0.241761 -0.244930 -0.219122
polarizability: 1.33373081e+02 6.49512604e+00 1.22036695e+02 -5.67607421e+00 8.09131377e+00 1.39517588e+02
1716.lowfreq: -7.0417 -4.9825 -0.0008 -0.0004 -0.0003 6.6816 15.6804 31.4412 41.4627
frequency: 15.2983 31.0161 41.4211 48.2287 65.3245 81.0026 85.5395 110.5648 134.3134 141.3031 161.7118 194.8073 215.0402 244.8261 264.3267 307.8129 324.6219 356.8118 389.6528 451.1386 469.6628 544.3090 560.1266 647.0780 711.8484 748.9652 792.5270 837.2444 904.2419 952.7972 978.0775 988.1653 1001.4772 1031.6660 1055.5510 1062.9334 1079.4094 1089.2850 1140.3316 1153.7765 1200.9492 1229.4571 1235.2141 1286.1519 1302.8097 1324.4421 1342.4329 1350.0731 1354.1210 1371.3060 1376.9913 1397.2052 1401.2607 1456.5647 1480.4718 1492.3764 1510.1643 1530.8905 2974.6028 3000.1294 3018.1574 3021.3126 3029.7438 3050.7205 3068.1423 3083.2126 3107.0511 3121.4389 3801.7657
redmass: 11.0329 4.6355 6.2172 2.8314 9.0933 5.6776 10.6852 5.0775 2.3884 3.5625 7.9659 6.0461 6.5072 1.0852 6.8666 14.8550 8.6620 4.7701 4.8327 6.2639 4.9089 8.4767 10.0464 4.9767 4.1614 1.1747 1.3531 2.8301 1.9383 5.0156 2.4274 8.2283 4.2973 3.4083 3.2139 3.1190 3.7260 4.5495 3.2421 3.3161 1.8672 1.2571 2.0784 1.2907 1.2604 1.0714 1.1858 1.2639 1.3365 1.2768 1.2378 1.3388 1.3852 1.4213 1.0828 1.0901 1.0961 1.0875 1.0544 1.1068 1.0646 1.0578 1.0617 1.0991 1.1004 1.1022 1.0880 1.0880 1.0665
irintensity: 5.5657 0.8559 5.9748 9.7905 1.4792 4.1865 4.3958 8.9994 7.4673 9.1137 2.2787 16.6677 5.3891 132.9939 1.0401 12.1830 5.5528 1.1903 10.2078 23.1444 31.1218 23.1569 3.8853 26.7865 37.7866 5.9965 2.7621 11.8409 35.0766 142.1483 116.4453 308.4360 16.1739 74.0927 39.7068 13.9241 135.1659 61.0861 51.1356 38.8484 75.7122 30.5224 101.6967 28.5533 28.6953 0.7451 22.7085 16.5910 11.5956 15.1319 2.2484 12.1568 11.7185 6.4322 3.6861 0.1277 5.5961 3.8524 66.3378 51.7163 16.5232 8.3176 90.4683 7.4909 24.0324 85.1997 44.3094 41.3535 34.6876
temp: 298.150 k
press: 1.00000 atm
elementType: 8 6 6 1 1 1 1 6 1 1 6 6 6 1 1 6 1 1 55 8 1 9 9 9 9
symmnumber: 1
zpe: 480500.4 jmol-1
zpe.correction: 0.183013 hartree
zpe.thermalcorrener: 0.199804 hartree
zpe.thermalcorrenthalpy: 0.200748 hartree
zpe.thermalcorrgfe: 0.133415 hartree
zpe.sumelectzpe: -843.541149 hartree
zpe.sumelectthermal: -843.524358 hartree
zpe.sumelectthermalent: -843.523414 hartree
zpe.sumelectthermalfe: -843.590747 hartree
dipole: 4.5467 8.8997 8.6236
dipole: 13.2001
quadrupole: -108.5128 -97.1058 -112.1383
quadrupole: -3.4223 -13.2945 -10.2728
quadrupole: -2.5938 8.8132 -6.2194 -3.4223 -13.2945 -10.2728
hfenergy: -843.7241616 hartree
pointgroup: C01 [X(C7H11Cs1F4O2)]
dipole: 1.7888171 3.5013921 3.3927664 debye
dipolederiv: -1.0351497 -0.1243887 -0.411709 -0.177481 -0.8781912 -0.2968876 -0.358522 -0.2403562 -1.5778768 0.0313111 -0.0219191 0.1163577 0.0051731 0.0134715 -0.0354971 0.1008659 -0.0600736 -0.0830486 0.1020418 -0.059264 0.0096313 -0.0291104 0.142787 -0.0564362 0.062436 0.010475 0.0876979 -0.0658864 -0.0216098 -0.0988973 -0.0162505 0.0544498 0.0169949 -0.1115283 -0.0354603 -0.1494 0.0160993 0.0830234 0.0068188 0.0517703 -0.1105137 -0.0068753 -0.011522 0.0161393 0.0654628 -0.0396601 -0.0329371 -0.1098718 -0.0058701 0.0320672 -0.0308647 -0.1330763 -0.0472562 -0.043968 0.0205875 0.0518531 -0.005147 0.0319224 -0.1711498 0.0500364 0.0020646 0.067761 0.0295529 0.0032189 -0.0328692 0.1334657 -0.107056 0.0998542 0.0570125 0.0629343 -0.0223624 0.1087287 -0.0437152 -0.0313857 -0.1013933 -0.0213169 0.0365536 -0.014566 -0.0812251 -0.0401163 -0.1167664 0.0078162 0.0606094 0.0046978 0.0533067 -0.1507837 0.0272461 -0.013051 0.0570659 0.0337545 0.547441 0.0471194 0.3836266 -0.0592152 0.2423933 -0.0017366 0.2242258 0.2201116 0.9381269 1.1694863 -0.0338668 0.3026111 0.0124483 1.3335805 -0.0777146 0.4088423 -0.0080798 0.9505845 1.1467318 0.145472 -0.3885535 0.1539798 1.1418187 0.1671607 -0.3740471 0.112583 0.9167579 -0.0464844 0.0067653 0.0746744 -0.0265538 0.0186978 0.0160224 0.0724381 -0.013123 -0.1030862 -0.0456907 0.0098437 -0.0887668 0.0579473 0.0063514 0.0665136 -0.0592015 0.0024034 -0.0858385 0.6220872 -0.1682335 -0.2656545 -0.1066223 0.430017 0.0572117 -0.2181983 0.1141663 0.7469022 -0.0276172 0.1000183 0.0188729 0.071977 -0.2119438 0.0232348 0.0223481 0.0647075 -0.0291472 -0.100266 -0.0319185 -0.0935767 0.0052523 0.0165148 -0.0304934 -0.0905302 -0.0643381 -0.1919696 0.8765952 0.0906681 0.1396751 0.133892 1.0133424 0.3052632 0.1588485 0.2353402 1.1925439 -0.7590788 0.1991759 0.3190546 0.2070596 -0.4445544 -0.0838369 0.3195305 -0.0768176 -0.914783 0.2450558 -0.0870844 0.0396402 -0.1013425 0.2110291 -0.0279303 0.0277712 -0.0408147 0.3106688 -0.7252833 0.1158999 0.3517435 0.2004004 -0.448371 -0.1991112 0.4712495 -0.1451702 -0.735369 -0.9014129 -0.1378441 -0.3949191 -0.1696748 -0.4414328 -0.0701576 -0.4916743 -0.0577957 -0.6814854 -0.5844441 -0.2858097 0.0733634 -0.3266455 -0.8792271 0.0449985 0.0004869 -0.0638643 -0.3597204 -0.4137833 0.1586821 -0.0157441 0.1620098 -1.0567608 0.1004127 0.0085345 0.0148753 -0.3083218 unknown
polarizability: 133.3730813|6.495126|122.0366949|-5.6760742|8.0913138|139.5175882 unknown
InChI: InChI=1/C7H11F4O2.Cs/c8-5(9)7(13,6(10)11)3-1-2-4-12;/h5-6,12H,1-4H2;/q-1;+1/rC7H11CsF4O2/c8-14-7(5(9)10,6(11)12)3-1-2-4-13/h5-6,13H,1-4H2
charge 0 multiplicity 1
25 atoms
O  -1.33823897 -0.30473888 -1.1677499
C  -1.40600938 -0.75014378 -3.57947008
C  -0.20214804 0.12752635 -3.92437559
H  -2.11457642 -0.76084166 -4.41548191
H  -1.05644918 -1.77709269 -3.4520488
H  0.42010105 0.21691283 -3.02956108
H  -0.52835267 1.13897685 -4.1845996
C  0.62464992 -0.44581144 -5.07867778
H  -0.00124838 -0.56165946 -5.96951949
H  0.98856429 -1.44378111 -4.81529451
C  -2.13831766 -0.38206524 -2.24937642
C  -3.22730374 -1.45915491 -1.98793267
C  -2.93095775 0.94347461 -2.46038302
H  -3.73869013 -1.29699995 -1.04033145
H  -3.52991152 1.01430777 -3.36833394
C  1.81341321 0.42608653 -5.43590257
H  1.46958723 1.42773794 -5.7269115
H  2.46967323 0.53912573 -4.56238553
Cs -0.6744708 1.61294171 0.64810499
O  2.52803139 -0.18707489 -6.51800839
H  3.27468449 0.37830849 -6.74492185
F  -3.78852472 1.17579501 -1.39074304
F  -4.20001372 -1.49997458 -2.98839206
F  -2.06725787 2.02682776 -2.45176756
F  -2.679837 -2.71628356 -1.95378965
