program: Gaussian 16
title: Title Card Required
version: ES64L-G16RevB.01
method: RB3LYP
basis: TZVP
operation: Freq
keyword: #P
keyword: Geom=AllCheck
keyword: Guess=TCheck
keyword: SCRF=Check
keyword: GenChk
keyword: RB3LYP/TZVP
keyword: Freq
converged: YES YES YES YES
title: Mulliken charges:
elementType: Cu N N C H C C H C H C C C H H H C H C H C H C C H C H H H C H H H C C C H C H C H C C H C H H H C H H H C H C H H H C H H H C H H H F B C C C H C C C H C H H H C C H H H H H H H H H H H C H H C H H C H H H
charge: -0.034786 0.009933 0.036189 -0.168651 0.167266 0.078482 -0.041113 0.141976 -0.039863 0.141480 -0.287777 0.254918 -0.386862 0.132699 0.118945 0.126207 -0.273862 0.125981 0.033396 0.117786 -0.289204 0.128828 0.242700 -0.170608 0.163951 -0.385674 0.136563 0.134525 0.107038 -0.381769 0.123935 0.126303 0.132492 -0.187759 0.189605 -0.249173 0.128763 -0.006111 0.120140 -0.234123 0.129592 0.173122 -0.169878 0.161216 -0.382566 0.122089 0.132586 0.124117 -0.403066 0.132083 0.133459 0.154509 -0.170022 0.158906 -0.382979 0.125135 0.132672 0.125735 -0.379871 0.109790 0.131897 0.132255 -0.425020 0.166294 0.131306 0.128017 -0.317773 0.161810 -0.158464 -0.069441 -0.315195 0.189049 -0.263325 -0.243920 -0.276211 0.148925 -0.269279 0.142051 0.128164 0.109575 -0.237785 -0.236445 0.112978 0.109813 0.121306 0.126408 0.128055 0.108668 0.123293 0.118087 0.123777 0.118602 0.059532 -0.325823 0.126579 0.129322 -0.201698 0.103966 0.093383 -0.379930 0.112451 0.117098 0.108251
chargesum: -0.00000
title: Mulliken charges with hydrogens summed into heavy atoms:
elementType: Cu N N C C C C C C C C C C C C C C C C C C C C C C C C C C C F B C C C C C C C C C C C C
charge: -0.034786 0.009933 0.036189 -0.001385 0.078482 0.100863 0.101617 -0.287777 0.254918 -0.009012 -0.147881 0.151182 -0.160376 0.242700 -0.006657 -0.007548 0.000961 -0.187759 0.189605 -0.120410 0.114029 -0.104531 0.173122 -0.008662 -0.003774 0.016986 -0.011116 0.000563 -0.005929 0.000597 -0.317773 0.161810 0.030585 0.079484 -0.113611 -0.025585 -0.021129 -0.028498 -0.032556 0.003595 0.005934 -0.069922 -0.004349 -0.042130
polarizability: 5.60121313e+02 -1.29510116e+01 6.24663911e+02 -1.91219185e+01 -1.34381712e+01 5.39787473e+02
1716.lowfreq: -133.1512 -6.1699 0.0038 0.0051 0.0065 4.0609 8.3964 17.0427 21.7721
redmass: 5.3292 3.5963 4.0013 3.7304 3.7893 2.9262 4.3918 3.9778 4.0235 3.8323 3.6724 3.5678 4.0496 2.8050 3.4198 4.0303 2.8503 1.8328 3.8177 5.2915 4.5884 3.6720 4.2209 3.2478 3.1901 3.2710 3.0650 3.0510 3.0101 4.0605 3.8167 3.3539 3.7376 2.9490 1.1283 1.1952 1.1500 1.1952 1.4517 1.5320 1.9888 2.0997 1.6091 1.7447 2.6121 2.6035 1.6797 1.4451 1.3903 1.6151 2.9583 2.5171 3.1317 3.6154 3.2131 3.0323 4.2860 2.6018 2.2012 2.2744 3.6502 4.6742 3.5667 4.1084 2.9903 2.0525 3.0906 2.8717 2.7184 3.8373 1.7585 4.8969 4.3984 3.9026 2.9223 4.2126 3.2314 3.0667 2.8705 2.6602 2.9425 3.7835 4.1770 3.3104 2.2015 4.4916 3.4505 1.5804 5.2168 1.5546 1.1918 3.6079 4.0489 3.7983 3.0134 2.6074 1.5802 1.7211 2.9245 3.7367 3.7422 1.3776 1.2345 1.4044 1.9002 2.0000 2.6094 2.6066 2.5397 1.5980 1.4043 1.3937 2.4386 1.2750 1.2768 1.3302 1.7860 1.6646 1.4986 2.4147 1.4718 1.4700 2.3395 1.4660 1.2913 1.2958 4.6358 1.8222 4.0731 1.7226 1.2047 2.7379 2.6799 2.0288 1.9894 2.0257 1.8256 2.2400 1.4970 1.5277 2.0645 2.2831 2.4496 1.8065 2.3569 2.2372 2.1907 2.2938 2.3121 1.5473 1.4020 1.6072 1.6983 1.7079 1.0491 2.0344 2.0277 1.3105 1.7484 1.6945 1.3212 1.3206 1.5889 2.6896 1.5779 1.3248 3.0243 4.1776 2.1356 2.1576 1.3165 3.3624 1.3724 1.2213 3.5024 3.5049 1.3702 1.2912 1.4120 2.3637 1.3715 1.5782 1.3323 1.1087 1.3367 1.3818 2.4831 1.4636 1.5705 1.3731 1.3228 1.2789 1.3777 1.3780 1.4818 1.4195 1.4444 2.2159 1.2117 1.2268 1.2613 1.2543 1.2127 1.2189 1.2145 1.2221 2.0493 1.4910 1.0954 1.0746 1.0539 1.0617 1.0862 1.0941 1.0534 1.1476 1.0707 1.1623 1.0920 1.1465 1.4659 1.2135 1.0452 1.1123 1.6159 1.3672 1.0998 1.1080 1.4845 1.0696 1.0930 1.0831 1.1219 1.0764 1.2998 1.2177 1.1980 1.1222 1.0857 4.8634 5.9061 5.6182 5.7464 5.8718 1.0743 1.0691 1.0663 1.0660 1.0678 1.0580 1.0813 1.0388 1.0613 1.0816 1.0828 1.0953 1.0348 1.0395 1.0352 1.0369 1.0393 1.0384 1.0383 1.0396 1.0732 1.0897 1.0866 1.0849 1.1031 1.0885 1.0856 1.0858 1.0863 1.0882 1.0946 1.1015 1.1025 1.1018 1.1024 1.1025 1.1025 1.1023 1.1025 1.1020 1.0896 1.1020 1.1002 1.0975 1.0995 1.0980 1.1005 1.0998 1.0984 1.0990 1.0786 1.0867 1.0868 1.0905 1.0903 1.0960 1.0957 1.0920 1.1105
irintensity: 126.1986 0.1996 0.0228 0.1964 0.7248 0.0898 0.9358 0.0306 0.2121 0.6629 0.2156 0.3779 0.2993 0.5107 0.0045 0.2908 0.4482 0.2450 0.9886 1.1633 0.2935 2.9548 0.1404 0.3427 0.1465 0.4323 3.5740 1.3627 1.2961 12.3385 10.3825 2.0997 10.2872 6.7777 1.5499 0.5730 0.2204 1.2656 0.3993 1.0874 1.2956 0.6084 2.9057 2.5720 1.9476 30.0378 1.0330 1.2878 0.7454 6.8656 0.3129 0.4929 0.9528 2.5371 1.3801 0.4624 0.2167 5.5126 1.2594 6.0236 7.1394 0.9345 3.0772 0.3460 1.6216 168.5535 24.2063 6.7764 4.7524 0.2997 31.1840 0.5907 0.1141 9.4540 51.4614 0.6162 0.1711 0.0492 0.0172 7.8159 0.1522 3.3816 1.5812 5.5308 37.2632 0.0990 18.7555 12.4531 1.8001 41.6396 0.5207 14.3882 4.6044 38.4613 14.4399 1.5316 37.1489 47.3785 1.2927 0.6089 4.3439 0.0726 12.4085 4.9530 15.7439 4.1680 0.4169 0.9201 36.1455 24.9628 1.0733 0.6740 0.9035 0.3122 1.4801 2.5217 1.0585 11.7211 4.2650 10.8257 0.0777 0.3765 9.5525 0.0356 0.3908 0.1633 0.4347 8.3467 6.0219 11.7956 4.8984 1.7361 23.7520 28.8297 3.0520 5.5705 42.8302 41.6188 0.3321 18.7123 58.8267 2.9613 5.6724 3.3219 3.1095 2.1468 4.8155 0.6316 6.7771 15.6117 18.7789 9.9451 0.2034 3.0601 0.0373 2.3617 1.5393 0.7980 1.0651 2.4780 1.8329 11.9553 6.5596 15.4041 82.7517 1.4768 0.7907 0.4987 1.9530 7.9317 2.7322 25.7577 1.1262 6.8423 0.0353 9.5056 17.0804 1.3144 9.6343 1.8765 1.6252 1.1574 1.3056 3.6977 2.0567 13.2620 24.5036 5.7198 43.9317 7.9495 2.9123 0.4836 1.0773 0.7893 8.6691 0.3014 9.3949 1.6164 0.8184 4.0136 6.6191 7.0791 9.2530 3.1330 5.3812 1.2297 52.1565 36.5789 6.9450 1.8622 1.3455 2.2096 10.0092 16.3199 1.0888 22.3668 2.9699 2.8045 5.1708 1.8417 13.0100 11.2781 6.7096 2.7875 2.9422 1.0790 12.6541 4.9508 24.5806 15.0577 4.1193 17.6260 11.1952 8.3310 19.6028 14.9182 12.9760 10.9629 10.5685 2.7168 0.7678 1.1008 8.1818 8.5816 34.8068 62.4703 43.7684 45.7630 62.1993 26.6752 113.6793 20.6012 80.1176 77.2417 168.9696 5.4960 28.3874 5.5587 25.8545 33.1890 22.4155 52.7448 9.5810 32.0987 97.2143 23.1886 15.2169 25.7515 30.0560 6.7229 1.3165 1.5295 1.0651 7.1699 75.4995 79.6171 82.3533 4.2651 5.4179 0.9375 35.9695 6.3486 50.8698 53.2890 86.7454 63.0081 7.2242 103.9739 39.5641 86.3867 71.0202 19.1637 9.8180 6.5622 22.8365 2.3485 3.0408 10.2780 10.3513 15.3088 14.6814 9.9672 3.1004
temp: 298.150 k
press: 1.00000 atm
elementType: 29 7 7 6 1 6 6 1 6 1 6 6 6 1 1 1 6 1 6 1 6 1 6 6 1 6 1 1 1 6 1 1 1 6 6 6 1 6 1 6 1 6 6 1 6 1 1 1 6 1 1 1 6 1 6 1 1 1 6 1 1 1 6 1 1 1 9 5 6 6 6 1 6 6 6 1 6 1 1 1 6 6 1 1 1 1 1 1 1 1 1 1 1 6 1 1 6 1 1 6 1 1 1
symmnumber: 1
zpe: 2382106.9 jmol-1
zpe.correction: 0.907297 hartree
zpe.thermalcorrener: 0.954947 hartree
zpe.thermalcorrenthalpy: 0.955891 hartree
zpe.thermalcorrgfe: 0.825723 hartree
zpe.sumelectzpe: -3396.393078 hartree
zpe.sumelectthermal: -3396.345427 hartree
zpe.sumelectthermalent: -3396.344483 hartree
zpe.sumelectthermalfe: -3396.474651 hartree
dipole: 7.3883 2.8531 4.7660
dipole: 9.2434
quadrupole: -229.9416 -274.7460 -219.4197
quadrupole: 3.3445 59.6723 14.3233
quadrupole: 11.4275 -33.3769 21.9494 3.3445 59.6723 14.3233
hfenergy: -3397.3003744 hartree
pointgroup: C01 [X(C39H59B1Cu1F1N2)]
dipole: 2.9067727 1.1225001 1.875076 debye
polarizability: 560.1213133|-12.9510116|624.6639109|-19.1219185|-13.4381712|539.7874727 unknown
InChI: InChI=1/C27H36N2.C8H14BF.C4H9.Cu/c1-18(2)22-11-9-12-23(19(3)4)26(22)28-15-16-29(17-28)27-24(20(5)6)13-10-14-25(27)21(7)8;10-9-7-3-1-4-8(9)6-2-5-7;1-3-4-2;/h9-16,18-21H,1-8H3;7-8H,1-6H2;1,3-4H2,2H3;/rC31H45CuN2.C8H14BF/c1-10-11-18-32-31-33(29-25(21(2)3)14-12-15-26(29)22(4)5)19-20-34(31)30-27(23(6)7)16-13-17-28(30)24(8)9;10-9-7-3-1-4-8(9)6-2-5-7/h12-17,19-24H,10-11,18H2,1-9H3;7-8H,1-6H2
charge 0 multiplicity 1
103 atoms
Cu 3.39776334 -0.25358666 5.72868904
N  4.89832542 1.355856 7.66810681
N  5.62689182 -0.6506976 7.75455798
C  4.14432912 -2.44963086 9.48072916
H  4.21970281 -1.36320384 9.526099
C  4.71033804 0.12509338 7.11932487
C  5.90550449 1.34661145 8.62112138
H  6.19037396 2.23151556 9.16194593
C  6.36792259 0.07635524 8.67511344
H  7.13898406 -0.37598513 9.27295309
C  5.74928329 -2.06437861 7.52046071
C  5.00919335 -2.93841487 8.32828251
C  4.65091657 -2.99975859 10.82210011
H  4.06055479 -2.59221434 11.64663377
H  5.69794326 -2.73752497 10.99262402
H  4.56928582 -4.08865314 10.86158437
C  5.08114342 -4.2992135 8.03000578
H  4.51142328 -5.00468237 8.62119992
C  5.85023701 -4.75789757 6.97025942
H  5.87550345 -5.81674 6.7423969
C  6.5823601 -3.86803732 6.19612036
H  7.17470995 -4.2419026 5.37094525
C  6.55578795 -2.49857308 6.46005986
C  7.34550471 -1.52497004 5.59810764
H  7.34312689 -0.55613106 6.09891686
C  6.67468383 -1.33425681 4.23062829
H  6.63528535 -2.27556106 3.67829704
H  7.22958724 -0.60974159 3.62954804
H  5.65248181 -0.969896 4.34293337
C  8.81183407 -1.94858715 5.44017595
H  8.90766687 -2.8762669 4.87183305
H  9.29092984 -2.09826685 6.41051347
H  9.36862461 -1.17721002 4.90246836
C  4.09656372 2.49648524 7.30810801
C  4.53130104 3.3167333 6.25804875
C  3.69218709 4.36227633 5.87230119
H  3.98378327 5.0071359 5.05328316
C  2.48081511 4.579051 6.51467889
H  1.83762552 5.38899162 6.19202885
C  2.08514289 3.75934552 7.56204433
H  1.13269042 3.93411793 8.04569561
C  2.88476395 2.69648414 7.98377714
C  2.41490481 1.77439413 9.09858982
H  3.23819638 1.10727791 9.35589626
C  2.04833936 2.55100911 10.37039583
H  2.87671495 3.17789489 10.70927144
H  1.79805579 1.8555149 11.1752721
H  1.18111446 3.19658584 10.2147921
C  1.24808414 0.89577916 8.62488158
H  0.38283881 1.5045728 8.35215071
H  0.94115057 0.21092258 9.41911595
H  1.52114983 0.29807908 7.7559813
C  5.84015142 3.06365473 5.52509334
H  6.41593034 2.3406256 6.10370412
C  6.69515557 4.33224836 5.40825788
H  6.22381294 5.08278294 4.77005899
H  7.66539347 4.09127438 4.96702146
H  6.87089339 4.78634353 6.38625065
C  5.58019623 2.43963796 4.14623242
H  5.03629229 1.49918121 4.23972375
H  6.5237581 2.23941342 3.63239778
H  4.98686033 3.10834261 3.51785458
C  2.66327164 -2.78761755 9.26435247
H  2.28763867 -2.36650857 8.33256602
H  2.06362375 -2.38412652 10.08430513
H  2.50180136 -3.8678061 9.23899415
F  1.11579197 -1.67268735 6.4168565
B  1.64031016 -2.02271551 5.16889512
C  2.84806989 -3.06337563 5.14890049
C  0.54179747 -2.44652136 4.09494257
C  2.08954515 0.20175028 4.28441362
H  3.66650144 -2.8244342 5.8338789
C  2.22882305 -4.39079183 5.68442642
C  3.43884056 -3.15792313 3.72908989
C  -0.08955746 -3.7200092 4.72981379
H  -0.25798579 -1.70204647 4.00817024
C  1.11349996 -2.7048444 2.68344447
H  1.76185292 -0.35481043 3.41329749
H  2.03597559 -4.24642287 6.75079305
H  2.97208669 -5.19413647 5.61571514
C  0.91879255 -4.85099803 5.01042565
C  2.42722557 -3.51240486 2.62694929
H  4.25943368 -3.88515204 3.70919509
H  3.88431019 -2.18567943 3.49548039
H  -0.88652551 -4.1041274 4.08169737
H  -0.56890103 -3.42782478 5.66926313
H  1.28697967 -1.73871799 2.20173869
H  0.36039236 -3.20884196 2.06482293
H  0.44146351 -5.60163182 5.64970377
H  1.14642139 -5.36708869 4.07766817
H  2.89649627 -3.35323829 1.6501042
H  2.20871114 -4.57968293 2.67190742
H  2.86353509 0.87284425 3.86823744
C  0.947117 1.06565827 4.82815948
H  0.18008062 0.42604615 5.27583618
H  1.31454598 1.69400666 5.64595376
C  0.29062829 1.9752498 3.78393559
H  -0.10166337 1.35823128 2.96727155
H  1.05825647 2.61936035 3.3393573
C  -0.82962126 2.83923031 4.36266831
H  -1.62269999 2.21895097 4.79090636
H  -1.2843981 3.48151224 3.60300225
H  -0.45125684 3.48470205 5.16113446
