program: Gaussian 16
title: Title CardRequired
version: ES64L-G16RevB.01
method: RB3LYP
basis: TZVP
operation: Freq
keyword: #P
keyword: Geom=AllCheck
keyword: Guess=TCheck
keyword: SCRF=Check
keyword: GenChk
keyword: RB3LYP/TZVP
keyword: Freq
title: Title Card Required
converged: YES YES NO YES
title: Mulliken charges:
elementType: C H H C H H C H H B C C H C C C H C H H C C H H H H H H H H H H C H H H
charge: -0.174258 0.100974 0.100808 -0.231676 0.115142 0.114760 -0.286579 0.142548 0.142632 -0.051365 -0.082982 -0.101538 0.144441 -0.282245 -0.284057 -0.287469 0.153781 -0.290335 0.123326 0.125830 -0.212692 -0.210904 0.125883 0.122794 0.125593 0.123545 0.123019 0.124347 0.133958 0.118245 0.133674 0.117803 -0.362151 0.110493 0.110535 0.124120
chargesum: -0.00000
title: Mulliken charges with hydrogens summed into heavy atoms:
elementType: C C C B C C C C C C C C C
charge: 0.027524 -0.001773 -0.001399 -0.051365 0.061458 0.052243 -0.033090 -0.035379 -0.038332 -0.042969 0.039511 0.040573 -0.017003
chargesum: 0.00000
polarizability: 1.82855818e+02 8.44162559e+00 1.66970583e+02 1.83770302e+00 3.24847775e+00 1.63343588e+02
1716.lowfreq: -25.3454 -10.5980 -0.0008 0.0005 0.0009 4.2218 27.9520 49.3312 80.1680
frequency: 23.5581 49.1357 80.1080 92.1707 98.0454 134.8913 219.4046 223.6381 229.1369 253.4719 310.6064 313.9432 336.5980 374.1276 443.0240 451.9757 493.5490 511.9532 587.9610 642.3535 734.5384 736.3642 772.2183 776.4964 781.1174 823.3713 855.1560 869.2336 896.1655 910.5533 920.6620 922.7571 927.1636 1001.1670 1010.9825 1018.0856 1046.4951 1051.7224 1063.5183 1068.6498 1080.1560 1096.7826 1098.2741 1122.2630 1140.6309 1159.5120 1175.2705 1177.7744 1231.9887 1243.3348 1259.3362 1280.5128 1282.6959 1293.4151 1311.3776 1332.0791 1338.0580 1339.7199 1344.8064 1358.4757 1364.3572 1384.7964 1386.6293 1389.1671 1394.4914 1396.3866 1406.5121 1419.5272 1428.8426 1484.2363 1485.8724 1486.2879 1494.1428 1495.5112 1499.8811 1501.3327 1501.7426 1508.1676 1531.1609 2960.9159 2977.9771 2984.7369 2989.3664 2991.5356 2992.8083 3000.3588 3007.2493 3008.3698 3018.1734 3018.5832 3018.9985 3020.3412 3021.5547 3022.1517 3024.9128 3030.3667 3033.8719 3044.6672 3078.7785 3080.3942 3082.6522 3105.5744
redmass: 3.3867 1.6022 3.2552 2.5427 2.3121 1.7133 2.7839 1.7059 3.6038 1.1261 4.5499 2.4154 2.8304 1.6825 2.7697 2.0970 3.7994 1.7036 4.4360 2.7622 1.4330 1.6166 2.9581 1.3749 3.1628 2.9872 1.3743 1.4553 1.9037 2.3963 1.6446 1.8763 2.2067 2.4610 1.7040 2.5915 1.3421 2.1722 2.6659 2.1297 1.8159 2.0908 2.3317 1.6623 1.8038 1.1178 1.1056 1.5526 1.5101 1.4278 1.3353 1.4573 1.4335 1.2258 1.1941 1.1616 1.5982 1.0673 1.4114 1.3123 1.5046 1.4318 1.3300 1.3035 1.4305 1.3731 1.5328 1.2371 1.2121 1.0818 1.0669 1.0724 1.0827 1.0672 1.0394 1.0865 1.0908 1.0833 1.0854 1.0620 1.0933 1.0673 1.0618 1.0612 1.0597 1.0581 1.0745 1.0631 1.0999 1.0397 1.0983 1.1010 1.1034 1.1032 1.0806 1.0719 1.0742 1.1047 1.1027 1.0938 1.1013 1.0875
irintensity: 0.0242 0.2102 0.0040 0.1385 0.0109 0.2407 0.0827 0.0635 0.0661 0.0148 0.0282 0.1273 0.1874 0.0624 0.8857 0.2684 0.4598 2.3410 0.7424 0.1427 13.4336 2.9710 0.1495 0.3030 0.9491 0.0133 0.0201 1.0605 7.2838 7.1153 9.2672 0.4765 0.2216 22.6593 0.0065 0.1304 2.9725 19.9732 8.3339 1.3499 10.0452 25.2103 14.0411 9.3641 7.8560 0.0097 0.4666 12.0005 0.1579 13.7505 2.5519 32.0498 24.2660 1.7267 0.7524 0.3838 16.5903 0.3558 8.2841 0.0492 70.3935 10.2974 0.2243 2.7149 1.4355 0.0725 43.0808 5.2914 2.5225 0.0424 0.3810 0.7494 9.1997 1.0487 9.3690 5.5410 8.8623 8.6576 9.6962 27.5397 9.2704 8.9911 50.6249 76.5963 2.5945 2.4112 65.7897 159.1031 32.0779 49.4319 86.7013 2.0519 23.5528 33.3628 117.4206 122.3922 24.7519 58.4101 72.5862 65.7370 57.2783 73.3232
temp: 298.150 k
press: 1.00000 atm
elementType: 6 1 1 6 1 1 6 1 1 5 6 6 1 6 6 6 1 6 1 1 6 6 1 1 1 1 1 1 1 1 1 1 6 1 1 1
symmnumber: 1
zpe: 872053.2 jmol-1
zpe.correction: 0.332148 hartree
zpe.thermalcorrener: 0.346057 hartree
zpe.thermalcorrenthalpy: 0.347002 hartree
zpe.thermalcorrgfe: 0.290722 hartree
zpe.sumelectzpe: -495.872786 hartree
zpe.sumelectthermal: -495.858876 hartree
zpe.sumelectthermalent: -495.857932 hartree
zpe.sumelectthermalfe: -495.914211 hartree
dipole: -0.0499 -0.0969 -0.0616
dipole: 0.1252
quadrupole: -86.6889 -86.3054 -85.6718
quadrupole: -0.5492 0.0375 -1.5906
quadrupole: -0.4668 -0.0834 0.5502 -0.5492 0.0375 -1.5906
hfenergy: -496.2049331 hartree
pointgroup: C01 [X(C12H23B1)]
dipole: -0.0196491 -0.038131 -0.0242276 debye
polarizability: 182.855818|8.4416256|166.9705834|1.837703|3.2484778|163.3435876 unknown
InChI: InChI=1/C12H23B/c1-2-3-10-13-11-6-4-7-12(13)9-5-8-11/h11-12H,2-10H2,1H3
charge 0 multiplicity 1
36 atoms
C  0.86762426 0.63525576 0.0371868
H  1.34400277 -0.32986676 0.24431067
H  1.0108227 0.82045048 -1.0335776
C  -0.62983423 0.52670525 0.32981006
H  -1.10512457 1.49269355 0.1240271
H  -0.77230077 0.3484818 1.40202848
C  -1.33878605 -0.57100355 -0.46756059
H  -1.18769676 -0.41055901 -1.54756192
H  -0.85039756 -1.54265129 -0.29112539
B  -2.87716343 -0.78462083 -0.25753809
C  -3.67791901 -1.91519678 -1.00723777
C  -3.82086431 0.0396731 0.69530313
H  -3.04353499 -2.50205962 -1.68199267
C  -4.22734745 -2.88919188 0.07235917
C  -4.7697525 -1.23237139 -1.87516022
C  -4.36269078 -0.94759505 1.76788112
H  -3.29914172 0.84057283 1.22851479
C  -4.91827595 0.70749237 -0.17910145
H  -3.37171651 -3.42091925 0.5062999
H  -4.84798503 -3.65762299 -0.40331565
C  -5.01898257 -2.22449528 1.21303747
C  -5.67694094 -0.24212453 -1.123565
H  -5.38803358 -1.99542559 -2.3624849
H  -4.26253134 -0.69471628 -2.68566791
H  -5.07219632 -0.42710154 2.42174758
H  -3.52117093 -1.23767881 2.40880955
H  -4.43393481 1.48504079 -0.78224183
H  -5.63506424 1.23061416 0.46476656
H  -5.1366857 -2.94497502 2.02881489
H  -6.02997694 -1.99916741 0.87549675
H  -6.23194575 0.35495152 -1.85427863
H  -6.43243416 -0.79129436 -0.56262406
C  1.56147754 1.73162672 0.84350986
H  1.12585863 2.71263708 0.63206035
H  1.46280174 1.55304997 1.91833813
H  2.62875832 1.78683441 0.61379927
