program: Gaussian 16
title: Title
version: ES64L-G16RevB.01
method: RB3LYP
basis: TZVP
operation: Freq
keyword: #P
keyword: Geom=AllCheck
keyword: Guess=TCheck
keyword: SCRF=Check
keyword: GenChk
keyword: RB3LYP/TZVP
keyword: Freq
converged: YES YES YES YES
title: Mulliken charges:
elementType: Cu N N C H C C H C H C C C H H H C H C H C H C C H C H H H C H H H C C C H C H C H C C H C H H H C H H H C H C H H H C H H H C H H H O C C H H H H C H H C C C C H H N H H H H H H H H
charge: -0.043546 0.007895 0.023515 -0.155517 0.155305 0.132025 -0.034307 0.147859 -0.043583 0.143986 -0.231935 0.222935 -0.386966 0.132853 0.124583 0.125721 -0.271970 0.127678 0.012753 0.119502 -0.271078 0.128831 0.248865 -0.186777 0.176190 -0.399157 0.129462 0.142674 0.147443 -0.388628 0.127008 0.122147 0.131555 -0.190823 0.185399 -0.244274 0.129464 -0.001406 0.118708 -0.262975 0.126078 0.207959 -0.179021 0.174964 -0.392974 0.121027 0.132138 0.126500 -0.415551 0.126481 0.135089 0.158459 -0.137008 0.143020 -0.377502 0.123438 0.135252 0.134237 -0.386140 0.115621 0.131373 0.134299 -0.387805 0.153673 0.125808 0.128722 -0.529181 -0.223973 -0.240690 0.090962 0.097107 0.101887 0.112175 -0.223453 0.103407 0.124775 -0.189588 0.269378 -0.378726 -0.450980 0.104002 0.106368 -0.454693 0.202811 0.202559 0.108560 0.090942 0.108519 0.126201 0.099539 0.132537
chargesum: -0.00000
title: Mulliken charges with hydrogens summed into heavy atoms:
elementType: Cu N N C C C C C C C C C C C C C C C C C C C C C C C C C C C O C C C C C C C N
charge: -0.043546 0.007895 0.023515 -0.000211 0.132025 0.113552 0.100403 -0.231935 0.222935 -0.003810 -0.144292 0.132254 -0.142247 0.248865 -0.010587 0.020422 -0.007918 -0.190823 0.185399 -0.114810 0.117302 -0.136896 0.207959 -0.004057 -0.013309 0.004477 0.006013 0.015425 -0.004847 0.020399 -0.529181 -0.035904 -0.026627 0.004729 0.020782 0.269378 -0.070705 -0.092702 -0.049322
polarizability: 4.79032230e+02 -4.03012152e+01 5.15862679e+02 -1.62284078e+00 -1.96233196e+00 5.47556071e+02
1716.lowfreq: -0.0041 -0.0026 0.0022 2.8162 4.0440 8.7176 19.9350 22.4251 27.5091
redmass: 4.2371 4.1290 4.2478 3.7588 4.7870 3.8641 4.0557 3.1907 3.5915 3.3702 2.8220 3.2810 3.3931 4.3681 3.2009 3.2011 2.7229 3.5809 2.8026 3.7642 3.1532 3.2178 3.5782 3.2471 2.5352 2.8791 4.4704 3.7081 3.3912 2.1199 2.3995 1.1421 1.2268 1.1303 1.2057 1.1574 1.3891 2.2779 1.7870 1.5482 1.5108 1.3314 1.1139 1.6716 2.1692 1.9303 3.0831 2.1909 2.0240 2.7453 2.2843 3.1006 3.4486 2.8771 3.5652 2.6694 4.7035 3.3871 3.0472 2.9516 2.5995 3.0433 3.2022 3.7815 2.9110 4.4916 4.8059 3.3833 3.9205 3.0902 3.0212 3.4380 3.9566 2.9995 3.5236 4.1499 3.3752 4.4473 2.7303 1.9069 4.3610 1.1197 4.4432 2.7762 2.9459 3.4023 1.2194 1.7566 1.9328 3.7186 3.7256 1.3021 1.3803 2.5788 1.8927 2.3174 1.5634 1.4064 1.3972 1.2631 1.7451 1.3811 1.5135 1.3542 1.8230 1.4422 3.6079 1.6850 1.5453 1.5367 2.3201 1.5127 1.3031 1.3052 2.0782 3.9020 1.6558 2.5710 1.9897 2.0350 2.3539 2.3583 1.5100 1.5316 1.6395 2.0305 2.0940 2.3481 2.3536 2.3340 2.3229 2.0740 1.6217 1.7114 1.4885 2.0455 2.0480 2.3024 1.7471 1.7120 2.0917 1.3118 1.3378 2.3064 2.7498 1.5733 2.9930 3.9743 2.1083 2.1842 3.2531 1.3607 3.7364 3.5311 1.2758 1.0605 1.8400 1.3345 1.3125 1.3080 1.8285 1.1763 1.6465 2.6569 1.5654 1.2739 1.4620 1.4286 1.3937 1.9174 1.2196 1.2868 1.2458 1.2960 1.2340 1.2192 1.2326 1.2236 1.4209 1.2173 2.9968 1.0797 1.0561 1.0528 1.1814 1.0907 1.1224 1.1231 1.0995 1.0943 1.0836 1.1009 1.1135 1.1051 1.4896 1.4299 1.5350 1.3583 1.1442 1.0706 1.0909 1.0663 1.1038 1.1587 1.1627 1.3790 1.0884 1.1835 1.0885 4.8856 6.2131 5.6706 6.1832 5.1698 1.0861 1.0742 1.0647 1.0635 1.0423 1.0601 1.0395 1.0348 1.0346 1.0347 1.0366 1.0353 1.0353 1.0361 1.0362 1.0950 1.0842 1.0844 1.0909 1.0863 1.0865 1.0978 1.0885 1.0981 1.0990 1.1025 1.1025 1.1024 1.1022 1.1025 1.1023 1.1024 1.1020 1.1010 1.1028 1.1018 1.1000 1.0995 1.0993 1.0992 1.0986 1.1020 1.0997 1.0867 1.0872 1.0904 1.0915 1.0959 1.0942 1.0920 1.1106 1.0497 1.0929
irintensity: 1.0150 0.4561 0.4955 0.6034 1.5513 0.0478 0.1617 0.6743 0.2461 1.1278 0.1432 1.0270 0.1009 1.1447 0.6908 0.6194 1.1160 1.7404 2.4222 1.9246 0.0980 0.1241 3.4164 2.2926 1.5377 0.6787 3.0106 3.1112 2.0471 12.4866 0.3493 0.1689 1.6098 0.3142 0.0107 3.3059 0.5380 0.2324 5.5965 12.0204 9.8214 0.7236 0.2899 0.7014 3.7590 3.2512 0.2566 3.0509 0.5838 1.8969 3.0083 1.4111 2.6644 2.1558 5.3524 3.7600 0.5543 2.4800 1.0115 7.8851 1.1194 9.9750 11.1483 0.9811 7.7467 0.2461 0.7358 12.0085 3.2058 0.0137 0.1642 9.0148 17.5528 0.6488 4.3466 1.1202 4.8620 0.1328 25.5723 33.4174 4.0036 3.1269 0.5381 26.4804 24.2238 7.7868 16.5164 34.8173 27.6941 1.3894 2.4847 127.7196 0.2069 0.2782 12.3603 4.6442 0.9301 0.7253 0.8844 0.5851 3.4823 3.1825 4.9984 8.2424 70.3195 8.6982 16.3095 3.4046 1.4911 1.2557 14.0956 3.8592 0.9654 0.4361 92.0949 1.1476 23.2447 5.1654 5.5796 0.7634 1.4546 13.9592 5.2354 17.5761 9.6850 7.4957 5.9932 3.6572 3.3640 4.0941 3.8106 4.9962 13.5330 0.3765 35.8802 1.7180 1.9056 18.2150 1.6669 2.2665 87.2046 6.8019 9.7231 45.7410 20.8472 5.3544 1.6918 0.4992 4.3959 5.9596 24.2879 11.7389 0.5921 8.6595 10.5945 1.8284 1.5342 4.3301 0.1200 0.5089 5.0691 8.3660 21.4680 24.7947 40.2511 20.1885 0.7727 9.8408 1.3800 7.1394 1.6696 4.6114 12.4171 1.5131 10.8609 3.1708 5.1528 3.9596 17.9438 4.4151 93.5239 0.5936 1.2245 5.1722 30.9961 10.7238 15.5962 3.3289 3.9287 1.1580 3.1833 6.9506 2.9971 1.4229 10.8536 2.4029 4.1551 16.0820 4.6544 16.6788 3.6631 10.9312 22.2707 5.3372 21.1577 9.0690 7.4672 5.3476 1.4470 4.0504 4.2311 1.7379 10.9277 1.6033 47.4416 87.3406 5.1781 90.7121 11.1510 61.5999 61.8980 12.4035 31.0228 35.6657 39.6143 36.3827 56.3128 14.9350 48.9832 0.8243 47.9541 4.7926 15.7132 0.6289 2.2360 98.0161 0.6466 11.7705 143.8753 0.4844 5.7386 28.3266 2.0866 31.5460 36.2040 47.8311 8.2054 84.1958 40.8918 26.9449 49.7279 70.0053 43.1680 85.4212 32.8012 41.2690 18.8134 3.2782 4.5254 12.0628 12.6430 18.5365 13.3633 10.4525 3.5255 0.4276 0.5669
temp: 298.150 k
press: 1.00000 atm
elementType: 29 7 7 6 1 6 6 1 6 1 6 6 6 1 1 1 6 1 6 1 6 1 6 6 1 6 1 1 1 6 1 1 1 6 6 6 1 6 1 6 1 6 6 1 6 1 1 1 6 1 1 1 6 1 6 1 1 1 6 1 1 1 6 1 1 1 8 6 6 1 1 1 1 6 1 1 6 6 6 6 1 1 7 1 1 1 1 1 1 1 1
symmnumber: 1
zpe: 2102339.9 jmol-1
zpe.correction: 0.800739 hartree
zpe.thermalcorrener: 0.844754 hartree
zpe.thermalcorrenthalpy: 0.845698 hartree
zpe.thermalcorrgfe: 0.723209 hartree
zpe.sumelectzpe: -3206.916966 hartree
zpe.sumelectthermal: -3206.872951 hartree
zpe.sumelectthermalent: -3206.872007 hartree
zpe.sumelectthermalfe: -3206.994496 hartree
dipole: 6.8995 5.4574 -0.0118
dipole: 8.7969
quadrupole: -195.3298 -244.8676 -237.7956
quadrupole: 9.2074 29.7333 10.9303
quadrupole: 30.6679 -18.8699 -11.7979 9.2074 29.7333 10.9303
hfenergy: -3207.7177054 hartree
pointgroup: C01 [X(C34H52Cu1N3O1)]
dipole: 2.7144651 2.1471024 -0.0046577 debye
polarizability: 479.0322301|-40.3012152|515.8626787|-1.6228408|-1.962332|547.5560711 unknown
InChI: InChI=1/C27H36N2.C7H16NO.Cu/c1-18(2)22-11-9-12-23(19(3)4)26(22)28-15-16-29(17-28)27-24(20(5)6)13-10-14-25(27)21(7)8;1-7(2,9)5-3-4-6-8;/h9-16,18-21H,1-8H3;3-6,8H2,1-2H3;/q;-1;+1/rC34H52CuN3O/c1-23(2)27-15-13-16-28(24(3)4)31(27)37-21-22-38(33(37)35-39-34(9,10)19-11-12-20-36)32-29(25(5)6)17-14-18-30(32)26(7)8/h13-18,21-26H,11-12,19-20,36H2,1-10H3
charge 0 multiplicity 1
91 atoms
Cu 3.26364042 -0.5405588 3.49236471
N  5.17618846 1.68011401 3.61675277
N  6.17669704 -0.21220475 3.64638168
C  6.23930086 -1.51942742 6.21915238
H  6.29778868 -0.45055991 6.01121926
C  4.93792484 0.34061992 3.56660426
C  6.53218022 1.95231402 3.73488815
H  6.91000746 2.95744355 3.79380701
C  7.16465455 0.75728082 3.74802018
H  8.20714472 0.50447181 3.82421155
C  6.41330309 -1.63144342 3.67187225
C  6.48455182 -2.26942805 4.91870896
C  7.29076648 -1.8278559 7.29182389
H  7.12345836 -1.20116461 8.17122077
H  8.3023452 -1.63569224 6.92646875
H  7.24445288 -2.86828005 7.62060352
C  6.71093805 -3.64561469 4.92260811
H  6.7625084 -4.17682084 5.86427509
C  6.84983474 -4.34887275 3.7334457
H  7.02020734 -5.41867698 3.75732679
C  6.75247552 -3.69304672 2.51474258
H  6.83629982 -4.25932413 1.59588931
C  6.5269069 -2.31694359 2.4556619
C  6.34339069 -1.62570521 1.11405457
H  6.28197972 -0.55153952 1.2912775
C  5.01611148 -2.05991659 0.47268896
H  5.0168046 -3.1297855 0.25170883
H  4.84850825 -1.52683463 -0.46515128
H  4.1755959 -1.85903587 1.13968294
C  7.52615644 -1.86430592 0.16675587
H  7.6210314 -2.91767458 -0.10591653
H  8.46930603 -1.54871024 0.61939144
H  7.38744621 -1.29835619 -0.75776182
C  4.12971252 2.66796016 3.5808234
C  3.85413915 3.30403362 2.35912232
C  2.80559223 4.22199821 2.33782738
H  2.55472777 4.73066158 1.41681247
C  2.06633076 4.48856362 3.48415592
H  1.24966711 5.19953819 3.44391399
C  2.36549248 3.84859614 4.67628766
H  1.77873981 4.06377147 5.56021733
C  3.40748158 2.92204271 4.75358104
C  3.71154766 2.22846809 6.07285058
H  4.55791521 1.55943716 5.91863185
C  4.12021429 3.2397741 7.15365197
H  4.97587045 3.83974772 6.83441526
H  4.39614083 2.71859282 8.07383885
H  3.30258612 3.92381891 7.39277987
C  2.52903841 1.36514195 6.53514936
H  1.64268574 1.97443714 6.72796018
H  2.78117468 0.84110455 7.46002567
H  2.2672071 0.61763696 5.784038
C  4.62144947 2.94717652 1.09339612
H  5.62941376 2.64757335 1.38570565
C  4.76892833 4.11742788 0.11581948
H  3.8139082 4.39452802 -0.33605853
H  5.44000672 3.83573718 -0.69882373
H  5.18269095 5.00280643 0.60384856
C  3.96751102 1.73989885 0.40162387
H  3.89304868 0.88707801 1.07610744
H  4.55011247 1.43797489 -0.47213237
H  2.95751518 1.98836809 0.06885463
C  4.8187603 -1.80699211 6.73176732
H  4.06671913 -1.55765706 5.98051998
H  4.61051189 -1.22235837 7.6313991
H  4.70118474 -2.86468198 6.98020143
O  1.68711938 -1.46371012 3.58147963
C  0.28462261 -1.54838242 1.60890344
C  1.15131527 -0.78598819 0.6087126
H  -0.76568688 -1.47946798 1.30007489
H  0.55561503 -2.6087566 1.5835157
H  2.14623001 -0.64564318 1.03880508
H  0.7401689 0.21645028 0.44924607
C  1.29196083 -1.49870543 -0.73653175
H  0.29796718 -1.75782807 -1.12369808
H  1.82727619 -2.44328325 -0.59781886
C  2.0274687 -0.66537322 -1.78008443
C  0.42865433 -1.10240362 3.08941172
C  -0.62519346 -1.85176151 3.92223423
C  0.18686951 0.41292072 3.22710398
H  1.47165695 0.27131315 -1.94401441
H  3.0075926 -0.38252981 -1.38818956
N  2.24175379 -1.43160837 -3.01614504
H  1.34966236 -1.71356431 -3.41072756
H  2.70128806 -0.85980134 -3.71696299
H  -0.50659193 -1.59467528 4.97745855
H  -1.64787942 -1.60959633 3.6162815
H  -0.47824802 -2.92985086 3.82238337
H  0.219515 0.69576034 4.28154741
H  -0.78024691 0.72026748 2.81564353
H  0.97235196 0.97303249 2.71504583
