program: Gaussian 16
title: Title
version: EM64L-G16RevB.01
method: RB3LYP
basis: Gen
operation: Freq
keyword: #P
keyword: Geom=AllCheck
keyword: Guess=TCheck
keyword: SCRF=Check
keyword: GenChk
keyword: RB3LYP/ChkBas
keyword: Freq
converged: YES YES YES YES
title: Mulliken charges:
elementType: O C C H H H H C H H C C C H H H H H H C H H Cs N H H
charge: -0.681770 -0.198704 -0.248110 0.079677 0.076192 0.089782 0.097977 -0.196611 0.092397 0.105807 0.262483 -0.395944 -0.427967 0.099644 0.099237 0.108845 0.094764 0.082191 0.081922 -0.191190 0.098967 0.104260 0.802682 -0.442745 0.202608 0.203604
chargesum: -0.00000
title: Mulliken charges with hydrogens summed into heavy atoms:
elementType: O C C C C C C C Cs N
charge: -0.681770 -0.042836 -0.060351 0.001593 0.262483 -0.120021 -0.137286 0.012038 0.802682 -0.036532
chargesum: 0.00000
polarizability: 1.52055705e+02 3.01648215e+00 1.33540749e+02 -2.60216824e+00 1.86957702e+00 1.56891214e+02
1716.lowfreq: 0.0000 0.0005 0.0007 4.6630 7.5110 13.5569 19.2205 47.0091 66.6611
frequency: 19.1636 46.9541 66.6524 71.7386 96.5145 127.3858 141.9261 158.8768 218.0932 243.2251 262.3203 269.6512 284.9798 347.5334 379.5973 445.0181 462.6779 495.4459 560.2566 744.4349 758.8947 790.6346 848.0718 871.5865 879.6282 940.0816 971.3402 985.8300 1007.3715 1034.3021 1060.9627 1068.5484 1086.3229 1142.2025 1171.5984 1204.8813 1220.1209 1247.5658 1271.6487 1310.9715 1323.4119 1332.6379 1351.6435 1370.0610 1382.2395 1390.5383 1426.3250 1468.3946 1478.2148 1483.4289 1486.3633 1489.5020 1500.3225 1503.8325 1520.6460 1648.8675 2944.6773 2980.6061 2993.2213 2994.2350 3003.6941 3006.8800 3017.5457 3029.6597 3038.4433 3054.2502 3058.5344 3063.1311 3071.5797 3082.3938 3478.4256 3554.9817
redmass: 6.8587 2.0523 3.7589 2.6425 3.0987 3.5297 2.1227 3.1810 2.2671 1.0532 1.4086 2.0044 1.3007 2.4507 2.9051 2.5516 3.1807 3.0136 3.1077 1.1753 2.6484 1.2617 1.3730 1.6387 1.6028 1.4156 2.3535 1.4323 2.2672 2.7164 2.3302 2.0554 1.8345 1.5045 2.3428 2.3300 2.9287 1.4713 1.4049 1.2859 1.0561 1.1756 1.3831 1.2631 1.4523 1.2964 1.4593 1.0803 1.0569 1.0550 1.0778 1.0553 1.0526 1.0925 1.0929 1.0874 1.0733 1.0583 1.0411 1.0615 1.0422 1.0690 1.0890 1.0826 1.0971 1.0977 1.1024 1.0982 1.1017 1.0994 1.0497 1.0928
irintensity: 6.5289 12.7015 5.1993 5.6490 2.7118 16.3201 8.9450 22.6556 15.1185 0.6766 40.2374 5.9971 0.6295 6.5677 12.4091 21.4153 25.6797 15.5169 1.8440 1.4883 1.6203 12.9619 86.3261 51.8993 26.4998 24.3131 3.0092 4.6042 128.8118 2.3123 0.8464 19.3363 15.0828 32.4732 35.7896 41.2565 162.2982 4.0266 11.3396 15.5358 6.2377 15.6257 4.8655 20.9307 2.5269 6.8867 14.7045 1.8152 0.9279 1.3087 0.8601 2.1814 1.8841 3.5726 2.9621 41.6840 92.2745 35.3620 37.4621 52.0632 102.2625 14.8682 54.6856 58.5063 5.8366 4.8744 85.0090 218.3421 88.2476 74.8251 0.3441 0.5431
temp: 298.150 k
press: 1.00000 atm
elementType: 8 6 6 1 1 1 1 6 1 1 6 6 6 1 1 1 1 1 1 6 1 1 55 7 1 1
symmnumber: 1
zpe: 591216.6 jmol-1
zpe.correction: 0.225183 hartree
zpe.thermalcorrener: 0.239024 hartree
zpe.thermalcorrenthalpy: 0.239968 hartree
zpe.thermalcorrgfe: 0.181263 hartree
zpe.sumelectzpe: -426.483391 hartree
zpe.sumelectthermal: -426.469549 hartree
zpe.sumelectthermalent: -426.468605 hartree
zpe.sumelectthermalfe: -426.527310 hartree
dipole: 5.0902 2.3043 8.4150
dipole: 10.1011
quadrupole: -95.4328 -83.1498 -77.6011
quadrupole: 3.4054 -5.2618 -6.4845
quadrupole: -10.0382 2.2448 7.7935 3.4054 -5.2618 -6.4845
hfenergy: -426.7085731 hartree
pointgroup: C01 [X(C7H16Cs1N1O1)]
dipole: 2.0026327 0.9065737 3.3107331 debye
dipolederiv: -1.3100056 -0.1033672 -0.5457975 -0.1063795 -0.8378615 -0.1216483 -0.5717814 -0.1352698 -1.8012791 0.0126858 -0.008888 0.1694965 0.0169906 0.0864704 -0.0682313 0.1339724 -0.0339647 -0.0510076 0.072068 -0.0730788 0.0467608 -0.0398499 0.1155684 -0.049947 0.1099798 0.0024349 0.0743816 -0.0712943 -0.0664912 -0.1205314 -0.0620953 0.0198497 -0.0303425 -0.1310198 -0.0772017 -0.208643 -0.0406364 0.1180855 -0.0058602 0.0794626 -0.1965092 0.0488498 -0.0277185 0.0814664 0.0352903 -0.0414446 -0.0450855 -0.1123039 -0.0244005 0.0037839 -0.0683912 -0.129501 -0.0823002 -0.0350552 0.0029244 0.0737065 -0.0252496 0.0658554 -0.1564281 0.0752829 -0.014265 0.0970756 -0.0103948 0.0442426 0.008644 0.1445547 -0.0759823 0.1034776 0.0523009 0.0757999 0.0075441 0.1399197 -0.034854 -0.0673773 -0.0956432 -0.0401745 0.0027633 -0.0639994 -0.0614844 -0.0875581 -0.1535158 -0.0159319 0.0831654 -0.0230187 0.0721311 -0.1308602 0.0619683 -0.0313788 0.0871909 0.0040729 0.8538211 0.0882305 0.3212316 0.0507335 0.5706112 0.0655649 0.2847514 0.0088498 1.0113312 -0.0777181 -0.1672248 0.0310578 -0.178139 -0.0618908 0.0140251 0.0848675 0.0665197 0.1057996 0.011913 0.0949646 -0.0433687 0.1594675 -0.1493025 0.1002255 -0.0149462 0.0602445 0.0723138 -0.068598 0.0686231 0.1196469 0.0433774 0.0359806 -0.0392515 0.1731673 -0.0947141 -0.1171238 -0.0578187 0.0122256 0.1208992 0.0638399 0.0307548 -0.0826731 0.1728133 -0.030475 -0.1352409 -0.0526298 -0.1631661 0.0293987 -0.1201821 -0.1199382 0.0600199 0.0049894 0.0382939 0.0511173 -0.0033743 0.1502844 -0.0384737 0.0681754 -0.17703 0.0585286 -0.019618 0.0637576 0.0405956 -0.0675269 0.0335399 -0.1632439 -0.0009476 0.0342255 -0.008771 -0.1871065 0.0348139 -0.1740851 -0.1054971 -0.0786761 -0.141579 -0.0604583 0.0240286 -0.0343309 -0.1891631 -0.0747408 -0.127981 0.4634446 -0.1813359 -0.1170995 -0.1209237 0.3577905 -0.0078977 -0.1740069 0.0865155 0.4622379 -0.1022767 0.1603305 0.0164118 0.1306837 -0.210227 0.042154 0.0031032 0.082311 -0.0405392 -0.0507638 -0.0542746 -0.070269 -0.021413 0.0022274 -0.0698813 -0.0869115 -0.0972506 -0.1266836 1.0008101 0.048123 0.3144455 0.0423435 0.7967028 0.0631159 0.3055014 0.0709257 1.3089348 -0.6494603 0.2073864 0.2188696 0.2384751 -0.5293639 -0.0136717 0.1793831 0.0043774 -0.4935735 0.1121384 -0.0517899 -0.1062829 -0.0142124 0.2742941 -0.0198578 -0.0435023 -0.0814017 0.055278 0.1757823 -0.0865537 0.0759482 -0.1663775 0.1108826 0.0368591 0.1540746 0.0025556 0.1138498 unknown
polarizability: 152.0557051|3.0164822|133.5407486|-2.6021682|1.869577|156.8912137 unknown
InChI: InChI=1/C7H16NO.Cs/c1-7(2,9)5-3-4-6-8;/h3-6,8H2,1-2H3;/q-1;+1/rC7H16CsNO/c1-7(2,10-8)5-3-4-6-9/h3-6,9H2,1-2H3
charge 0 multiplicity 1
26 atoms
O  -1.43485152 -0.08155105 -1.17906632
C  -1.39243885 -0.75863415 -3.50918803
C  -0.27650183 0.18813525 -3.94962475
H  -2.05241165 -0.96514253 -4.36235775
H  -0.94486366 -1.71698235 -3.21905319
H  0.27099327 0.50345743 -3.05569836
H  -0.70839722 1.09523818 -4.38700969
C  0.69418206 -0.43578129 -4.95551596
H  0.13555327 -0.79915027 -5.82790669
H  1.1777508 -1.31320464 -4.51317019
C  -2.23065131 -0.27233792 -2.28297624
C  -3.29643863 -1.36143531 -2.00165401
C  -2.97948034 1.03525886 -2.65044796
H  -3.62934411 1.32407715 -1.81907568
H  -3.90488257 -1.06326344 -1.14268251
H  -2.26730108 1.84903123 -2.80612906
H  -2.8020894 -2.30430198 -1.74892975
H  -3.59927208 0.94257452 -3.55036416
H  -3.96709558 -1.54279364 -2.85010215
C  1.77649529 0.52751029 -5.43266624
H  1.29675084 1.41219214 -5.87922497
H  2.35015607 0.88311823 -4.57087384
Cs 0.02666924 0.20517763 0.98778565
N  2.71487687 -0.13862839 -6.34823557
H  2.22151291 -0.46314088 -7.17433752
H  3.42114086 0.51426407 -6.67150824
