program: Gaussian 16
title: Title
version: ES64L-G16RevB.01
method: RB3LYP
basis: TZVP
operation: Freq
keyword: #P
keyword: Geom=AllCheck
keyword: Guess=TCheck
keyword: SCRF=Check
keyword: GenChk
keyword: RB3LYP/TZVP
keyword: Freq
converged: YES YES YES YES
title: Mulliken charges:
elementType: Cu N N C H C C H C H C C C H H H C H C H C H C C H C H H H C H H H C C C H C H C H C C H C H H H C H H H C H C H H H C H H H C H H H O C C H H H H C H H C C C C F F F F H H N H H H H
charge: -0.020895 0.004635 0.027518 -0.154921 0.154992 0.145272 -0.031743 0.149713 -0.042704 0.146112 -0.236524 0.219615 -0.385654 0.134789 0.125129 0.126290 -0.269886 0.129624 0.010896 0.121223 -0.271157 0.130029 0.247007 -0.187415 0.176806 -0.398742 0.132859 0.145485 0.139249 -0.388613 0.128131 0.124041 0.132447 -0.188814 0.182035 -0.245332 0.131172 -0.003775 0.121330 -0.240807 0.129322 0.193804 -0.197939 0.171730 -0.391091 0.118778 0.132043 0.128867 -0.394885 0.130782 0.132564 0.163462 -0.135966 0.144434 -0.375275 0.124073 0.135299 0.135253 -0.394394 0.110442 0.134098 0.137259 -0.385867 0.150178 0.130440 0.130327 -0.518277 -0.263922 -0.252315 0.143795 0.116627 0.111295 0.132736 -0.232438 0.111952 0.125781 -0.192102 0.160505 0.239747 0.164274 -0.218794 -0.206603 -0.223843 -0.202546 0.109244 0.107738 -0.453743 0.204648 0.204867 0.140778 0.113440
chargesum: -0.00000
title: Mulliken charges with hydrogens summed into heavy atoms:
elementType: Cu N N C C C C C C C C C C C C C C C C C C C C C C C C C C C O C C C C C C C F F F F N
charge: -0.020895 0.004635 0.027518 0.000071 0.145272 0.117970 0.103407 -0.236524 0.219615 0.000554 -0.140261 0.132119 -0.141128 0.247007 -0.010609 0.018851 -0.003994 -0.188814 0.182035 -0.114160 0.117555 -0.111485 0.193804 -0.026209 -0.011403 0.031922 0.008468 0.019351 -0.012595 0.025078 -0.518277 -0.003500 -0.008284 0.005295 0.024881 0.160505 0.353187 0.305052 -0.218794 -0.206603 -0.223843 -0.202546 -0.044227
polarizability: 4.70441284e+02 -4.32412768e+01 5.06763519e+02 3.68240542e-01 -2.01506504e+00 5.43087218e+02
1716.lowfreq: -1.6975 -0.0030 -0.0025 0.0014 7.3463 10.1587 16.9161 20.5462 26.4903
redmass: 6.8096 4.7129 4.3711 3.8238 5.4814 5.3920 4.4816 4.3649 3.8509 5.9978 3.9010 6.0938 3.2494 3.8306 3.7661 3.6429 3.2141 2.6137 4.2938 2.7930 5.1187 3.9111 3.1621 5.8538 3.7663 4.1974 3.5491 2.9270 3.1179 4.3503 4.6334 6.5424 3.1273 3.8388 2.8816 1.1932 1.2536 1.0960 1.2686 2.2662 1.7017 2.5454 2.0010 1.5137 1.7853 1.4771 1.2571 1.4466 1.8439 1.9890 3.0539 2.9636 3.7045 3.2531 5.2189 4.0223 5.5722 5.9014 4.5874 4.7153 3.4364 4.9392 3.0433 2.9596 2.5687 3.2399 4.9283 3.8022 4.8856 4.4935 4.7935 8.5384 4.2491 13.4533 3.0996 2.9628 3.2577 3.4184 4.1160 3.5793 4.1437 3.3195 4.4384 3.9819 2.8479 4.6281 1.8225 3.4855 3.3157 1.1560 3.0385 1.7113 1.8863 1.2477 3.7218 3.7003 1.3247 1.3815 4.2019 2.6003 2.5909 1.4088 1.4078 1.6447 1.2487 1.7635 1.4778 1.2455 1.5222 1.4552 2.7797 2.8538 2.0941 1.4821 1.5460 1.5085 1.3003 1.3003 4.5503 6.3858 3.6016 3.5928 6.2007 3.7974 1.9792 1.9908 2.5319 1.5100 4.0326 1.5429 1.8527 2.3087 2.4408 2.3510 2.3617 2.3221 2.3121 2.1220 3.6727 1.6809 1.7445 1.7670 2.0482 2.0551 1.7553 1.7471 2.1985 1.4748 1.9454 1.4963 2.6693 3.0128 1.7199 3.6638 2.1261 2.2116 3.6459 1.3099 3.6718 3.4940 1.3434 1.0844 1.8830 1.3380 1.3464 1.3560 1.6580 1.2101 1.1079 3.9573 1.5607 1.4124 1.1751 1.2318 1.3690 1.4469 1.7006 1.2176 1.4233 1.2480 1.2129 1.3909 1.2181 1.2235 1.2162 1.4448 1.2173 3.0580 1.3743 1.0854 1.0495 1.2923 1.0823 1.0526 1.1458 1.1154 1.1403 1.1962 1.0848 1.3925 1.4141 1.4865 1.3737 1.0950 1.0999 1.0811 1.0917 1.0919 1.2009 1.3581 1.3002 1.1092 1.0888 4.8605 6.0507 5.6816 5.2511 6.0633 1.0860 1.0741 1.0643 1.0624 1.0347 1.0347 1.0360 1.0365 1.0353 1.0352 1.0365 1.0628 1.0364 1.0860 1.0903 1.0854 1.0858 1.0864 1.0969 1.0870 1.0860 1.0910 1.1006 1.1023 1.1026 1.1024 1.1023 1.1021 1.1025 1.1023 1.1026 1.1017 1.1001 1.0993 1.0998 1.0981 1.1012 1.1009 1.0998 1.0868 1.0874 1.0905 1.0905 1.0959 1.0953 1.0921 1.1105 1.0498 1.0929
irintensity: 0.3432 0.9620 0.2010 0.0583 1.3487 0.9396 0.5099 0.1863 0.1744 0.7786 1.0874 0.7382 0.8385 0.2912 0.2142 0.1951 0.0499 1.1401 0.8132 3.5058 0.9404 1.0761 0.0395 0.5272 0.1028 2.3103 0.9246 0.5190 2.0575 2.6288 1.2795 2.5157 4.7059 4.1861 1.2802 0.5876 1.4830 0.5225 0.4421 14.4771 2.2314 1.1049 2.2196 2.2915 26.4108 2.6272 0.7516 1.1004 3.5038 1.3277 0.3576 0.0889 3.3697 1.2847 2.8667 0.9888 1.7954 2.3812 4.3130 0.3286 2.9788 2.1344 1.2049 9.7483 1.2607 16.4400 31.0192 1.7228 43.4066 0.2484 0.2150 6.4220 2.7200 0.6433 0.0905 0.0055 0.0524 10.5841 28.2890 3.9750 1.2078 5.0447 0.1598 5.2595 22.5650 4.5120 34.8359 6.2927 18.7331 8.8104 25.4249 36.8522 32.0294 14.9997 1.0638 2.5201 139.1508 0.7269 5.9200 0.3922 0.9803 1.2225 0.7688 24.6723 1.7950 5.2086 4.1992 1.1871 10.1238 7.2290 12.6258 0.9751 7.0466 0.1340 1.4252 0.8494 0.6464 0.2103 2.4083 3.7046 49.9188 98.8481 392.7037 74.7794 6.2871 1.4847 31.4335 4.7270 8.0604 19.4549 4.7041 6.0721 89.5543 3.6666 2.6288 4.0818 8.0998 2.8343 148.1200 38.0903 1.3120 85.2200 2.2312 0.5557 1.0654 6.0191 56.2754 7.4296 56.0056 12.4068 22.6529 1.7715 11.5132 1.6639 2.4571 7.4477 22.2032 9.1116 0.7328 9.4128 11.6247 2.6397 1.3720 2.2368 1.4463 2.8760 0.7275 22.2083 7.5596 29.0878 38.6101 3.6454 9.6374 2.8079 2.1985 8.4651 7.3738 2.1023 2.0458 7.9732 10.6068 4.2419 3.0822 6.3401 5.0471 21.0124 6.2866 90.6295 16.2439 3.5703 6.9552 47.3802 1.6003 2.1620 9.1241 2.7366 2.6263 7.8582 1.6538 5.3798 3.9182 5.9888 16.8721 18.5914 7.2864 7.5280 7.0469 21.1546 18.1711 3.8235 11.6960 9.0582 1.5676 3.8944 4.2082 1.5821 3.3013 9.9763 47.4634 84.4591 29.9987 24.5245 30.8510 22.9870 30.2197 40.3145 39.0157 9.3371 56.0829 35.9526 33.5140 30.4527 9.0746 8.7123 0.7438 2.5085 42.3452 1.1711 53.3907 14.5382 82.5271 31.1905 4.1305 1.7293 29.6853 5.7082 48.1442 7.9852 46.1994 31.6900 45.3882 44.0891 117.0980 43.7258 56.9099 23.4530 24.6341 3.2543 4.0280 11.2908 8.2646 17.3915 12.1687 11.1712 4.3048 0.1285 0.8899
temp: 298.150 k
press: 1.00000 atm
elementType: 29 7 7 6 1 6 6 1 6 1 6 6 6 1 1 1 6 1 6 1 6 1 6 6 1 6 1 1 1 6 1 1 1 6 6 6 1 6 1 6 1 6 6 1 6 1 1 1 6 1 1 1 6 1 6 1 1 1 6 1 1 1 6 1 1 1 8 6 6 1 1 1 1 6 1 1 6 6 6 6 9 9 9 9 1 1 7 1 1 1 1
symmnumber: 1
zpe: 2024931.6 jmol-1
zpe.correction: 0.771256 hartree
zpe.thermalcorrener: 0.818298 hartree
zpe.thermalcorrenthalpy: 0.819242 hartree
zpe.thermalcorrgfe: 0.688836 hartree
zpe.sumelectzpe: -3604.077553 hartree
zpe.sumelectthermal: -3604.030511 hartree
zpe.sumelectthermalent: -3604.029567 hartree
zpe.sumelectthermalfe: -3604.159973 hartree
dipole: 11.5609 3.3994 -2.4305
dipole: 12.2930
quadrupole: -207.1714 -254.3820 -269.2446
quadrupole: 7.6120 44.8160 5.6173
quadrupole: 36.4279 -10.7826 -25.6453 7.6120 44.8160 5.6173
hfenergy: -3604.848809 hartree
pointgroup: C01 [X(C34H48Cu1F4N3O1)]
dipole: 4.5484214 1.337415 -0.956241 debye
polarizability: 470.4412843|-43.2412768|506.7635186|0.3682405|-2.015065|543.0872176 unknown
InChI: InChI=1/C27H36N2.C7H12F4NO.Cu/c1-18(2)22-11-9-12-23(19(3)4)26(22)28-15-16-29(17-28)27-24(20(5)6)13-10-14-25(27)21(7)8;8-5(9)7(13,6(10)11)3-1-2-4-12;/h9-16,18-21H,1-8H3;5-6H,1-4,12H2;/q;-1;+1/rC34H48CuF4N3O/c1-21(2)25-13-11-14-26(22(3)4)29(25)41-19-20-42(30-27(23(5)6)15-12-16-28(30)24(7)8)33(41)35-43-34(31(36)37,32(38)39)17-9-10-18-40/h11-16,19-24,31-32H,9-10,17-18,40H2,1-8H3
charge 0 multiplicity 1
91 atoms
Cu 3.26436953 -0.51399686 3.50500011
N  5.20386748 1.66289548 3.63110584
N  6.19275246 -0.23619846 3.65805013
C  6.24886534 -1.55724298 6.22455534
H  6.33039735 -0.48812656 6.02556211
C  4.96052928 0.32625297 3.57658807
C  6.56001788 1.92686066 3.75418531
H  6.94352021 2.92952367 3.81814743
C  7.18577006 0.72749934 3.76543025
H  8.22647382 0.46825932 3.84418049
C  6.41754417 -1.65797112 3.67619277
C  6.48513867 -2.30268014 4.91983164
C  7.28666867 -1.89546652 7.30137356
H  7.12792009 -1.2698048 8.18291948
H  8.30451536 -1.72431637 6.94320407
H  7.21457659 -2.93610099 7.6246298
C  6.69678126 -3.68133625 4.91556947
H  6.74589633 -4.21797608 5.85417188
C  6.82478828 -4.37979387 3.72236714
H  6.98481073 -5.45127846 3.74037601
C  6.73101056 -3.71685366 2.50716578
H  6.80729618 -4.27927798 1.58532786
C  6.52020696 -2.33806733 2.45581826
C  6.33957593 -1.63798779 1.11825804
H  6.30101415 -0.56339388 1.29953555
C  4.99884621 -2.0442929 0.48629902
H  4.97521029 -3.11425458 0.26734031
H  4.83596203 -1.5093564 -0.45115806
H  4.16697764 -1.82444091 1.15865401
C  7.50854332 -1.89583829 0.15912729
H  7.57841258 -2.94895679 -0.12156774
H  8.46188766 -1.60364266 0.60573341
H  7.37418862 -1.32066326 -0.76024
C  4.15107848 2.64531461 3.5891648
C  3.86806231 3.2661343 2.3615169
C  2.7919601 4.15144659 2.32659908
H  2.53162878 4.64568477 1.40021686
C  2.03510296 4.40059372 3.46572146
H  1.19376634 5.08115011 3.41399869
C  2.3462589 3.78026829 4.66529079
H  1.74350711 3.97938988 5.54176749
C  3.41613492 2.88740164 4.75703053
C  3.73731258 2.21766241 6.08454482
H  4.58874912 1.55390593 5.93368304
C  4.14977124 3.25494213 7.13947419
H  4.99906408 3.85338009 6.80062405
H  4.43564227 2.75565494 8.06870036
H  3.32889499 3.93826348 7.36918371
C  2.56807957 1.35523643 6.58037546
H  1.68419974 1.96128452 6.78888661
H  2.84548785 0.84152626 7.5037671
H  2.28199627 0.60211373 5.8451853
C  4.65421116 2.92512752 1.10284994
H  5.66008214 2.62879532 1.40495347
C  4.8074193 4.10708385 0.14019206
H  3.85633408 4.38682835 -0.31782492
H  5.48833244 3.8381389 -0.67059699
H  5.21225938 4.98760715 0.64396514
C  4.01747722 1.72091475 0.39013246
H  3.94409491 0.85999824 1.05475044
H  4.61155588 1.43231485 -0.48037435
H  3.00967227 1.96581681 0.04796915
C  4.81982199 -1.82035669 6.72658803
H  4.07672919 -1.54818708 5.97442437
H  4.61700734 -1.2399518 7.62978488
H  4.67893628 -2.87760951 6.96423547
O  1.6191968 -1.34151954 3.60150456
C  0.23407659 -1.45802426 1.60442306
C  1.13173063 -0.72217973 0.6098137
H  -0.80913044 -1.37123672 1.2924397
H  0.49416716 -2.52054446 1.60194316
H  2.12858695 -0.60337741 1.04147323
H  0.74172534 0.28520491 0.43368502
C  1.25999826 -1.4565379 -0.72468089
H  0.26169049 -1.69516957 -1.11193471
H  1.77280097 -2.41118957 -0.57172253
C  2.02034279 -0.65212321 -1.7733694
C  0.39395659 -1.00029569 3.07997147
C  -0.64537431 -1.78292167 3.90978548
C  0.1888418 0.52853415 3.15777092
F  -0.95559027 0.94597738 2.50444243
F  0.08137638 0.98461878 4.44603619
F  -1.94352961 -1.51617345 3.51485599
F  -0.58435094 -1.48877781 5.24531811
H  1.48556961 0.2935467 -1.9533926
H  3.00376147 -0.38537873 -1.37856939
N  2.22546025 -1.44154254 -2.99512051
H  1.33035775 -1.69772195 -3.40027121
H  2.71537737 -0.89552579 -3.69582457
H  1.03881866 1.04143195 2.70343774
H  -0.47357965 -2.85580663 3.79996743
