program: Gaussian 16
title: Title
version: EM64L-G16RevB.01
method: RB3LYP
basis: Gen
operation: Freq
keyword: #P
keyword: Geom=AllCheck
keyword: Guess=TCheck
keyword: SCRF=Check
keyword: GenChk
keyword: RB3LYP/ChkBas
keyword: Freq
converged: YES YES YES YES
title: Mulliken charges:
elementType: O C C H H H H C H H C C C H H H H C H H Cs N H H F F
charge: -0.680348 -0.239643 -0.241007 0.108449 0.097200 0.113843 0.087687 -0.201501 0.092908 0.112072 0.232805 -0.063709 -0.082120 0.111015 0.123952 0.121006 0.117506 -0.189822 0.094978 0.109501 0.825649 -0.442349 0.202318 0.204628 -0.314557 -0.300461
chargesum: -0.00000
title: Mulliken charges with hydrogens summed into heavy atoms:
elementType: O C C C C C C C Cs N F F
charge: -0.680348 -0.033994 -0.039477 0.003478 0.232805 0.168312 0.159338 0.014657 0.825649 -0.035402 -0.314557 -0.300461
chargesum: 0.00000
polarizability: 1.38278930e+02 3.54076183e+00 1.28960097e+02 -9.48209509e+00 7.29891097e+00 1.56602033e+02
1716.lowfreq: -6.5731 -0.0010 -0.0008 -0.0004 8.3471 10.1273 23.3848 45.5732 60.3155
frequency: 23.2108 45.5507 60.2444 62.8700 79.5178 99.8219 111.0421 136.2508 143.8788 164.6542 205.4418 217.2973 244.6847 266.0683 307.2380 365.8433 385.2807 434.9695 474.8118 545.3050 628.8931 742.3674 768.7008 795.2730 846.1623 867.2556 914.6165 930.1897 942.7441 958.1912 975.7956 1029.1510 1055.8277 1065.6197 1084.7661 1140.8284 1158.2095 1173.9232 1208.7481 1242.5550 1265.4893 1269.8321 1289.1970 1321.5697 1326.9887 1341.8793 1360.4271 1374.2202 1392.3060 1396.4869 1427.5711 1474.5913 1486.2313 1487.7974 1489.0399 1505.7126 1520.8591 1649.8543 2939.0158 2995.8809 3002.7563 3007.4641 3036.2119 3039.8233 3048.4810 3058.0189 3061.7521 3068.7922 3120.5338 3122.2247 3480.0299 3557.3443
redmass: 7.3972 2.1797 3.4689 8.6656 5.1082 7.0273 4.1689 2.0060 3.8981 3.7085 3.8903 3.2517 1.8926 1.9842 2.9545 3.6448 3.6864 4.5682 3.9076 3.2905 3.8129 1.2215 1.9242 1.5362 1.4016 1.5836 4.7054 5.0799 1.6492 2.6468 2.4763 3.0499 2.2824 2.0719 2.2137 1.6142 2.9262 2.2243 2.5402 1.2446 1.2435 1.3549 1.2908 1.3110 1.0535 1.1831 1.3993 1.2459 1.5170 1.2763 1.4626 1.0851 1.0819 1.0815 1.0804 1.0924 1.0932 1.0880 1.0735 1.0667 1.0647 1.0617 1.0857 1.0925 1.0956 1.0585 1.0554 1.0992 1.1104 1.1122 1.0496 1.0930
irintensity: 5.5058 5.5882 4.0235 5.5004 1.7071 4.5375 8.9402 1.0563 11.6791 6.3429 27.0815 24.3560 18.8097 32.0062 7.3628 8.3614 18.0530 27.7854 18.8812 18.1714 22.8294 3.7120 1.4860 17.7173 86.5382 71.5722 141.9838 136.5267 34.0679 74.7495 8.3837 0.5896 14.2973 22.5094 9.1441 18.2559 73.5018 5.4834 93.6517 10.6774 4.9521 3.1490 20.7554 11.8470 3.1795 14.5466 3.4027 1.3161 1.0824 0.4750 14.3913 3.6227 1.6775 2.4006 12.2643 2.5206 3.0020 41.5724 98.2999 19.7763 14.1910 75.4839 44.1763 31.9963 11.6724 38.5477 28.2611 156.7722 38.6251 49.7902 0.2639 0.5813
temp: 298.150 k
press: 1.00000 atm
elementType: 8 6 6 1 1 1 1 6 1 1 6 6 6 1 1 1 1 6 1 1 55 7 1 1 9 9
symmnumber: 1
zpe: 555199.9 jmol-1
zpe.correction: 0.211464 hartree
zpe.thermalcorrener: 0.226767 hartree
zpe.thermalcorrenthalpy: 0.227711 hartree
zpe.thermalcorrgfe: 0.165158 hartree
zpe.sumelectzpe: -625.060000 hartree
zpe.sumelectthermal: -625.044697 hartree
zpe.sumelectthermalent: -625.043753 hartree
zpe.sumelectthermalfe: -625.106307 hartree
dipole: 1.8497 6.1011 9.0365
dipole: 11.0591
quadrupole: -108.3787 -88.2818 -85.1216
quadrupole: -3.2469 -17.8466 -9.1919
quadrupole: -14.4513 5.6455 8.8058 -3.2469 -17.8466 -9.1919
hfenergy: -625.2714642 hartree
pointgroup: C01 [X(C7H14Cs1F2N1O1)]
dipole: 0.7277267 2.400338 3.5552419 debye
dipolederiv: -0.9726623 -0.0511153 -0.3334548 -0.1008542 -0.8333862 -0.244749 -0.2519617 -0.1874986 -1.7161046 0.043173 -0.0324869 0.1375639 0.0181942 0.0765376 -0.0625415 0.1217794 -0.0482041 -0.0893017 0.0777525 -0.0681729 0.0216334 -0.0427191 0.1449525 -0.061138 0.0934178 -0.0107857 0.0405878 -0.0600122 -0.0271686 -0.109865 -0.0215949 0.0489055 0.0151191 -0.1118847 -0.0376606 -0.170178 -0.0029328 0.0865833 0.0159948 0.0441577 -0.1771262 0.0177721 -0.0063178 0.0487789 0.0510087 -0.028816 -0.0290007 -0.104078 -0.0061751 0.0271686 -0.0392656 -0.1312843 -0.0536424 -0.0226787 0.0015776 0.0647572 -0.0016956 0.0604314 -0.1984478 0.0480596 0.0020248 0.0725868 0.0168543 0.0496686 -0.0047849 0.1492434 -0.0764357 0.0950506 0.0363648 0.0656827 0.0016412 0.1473427 -0.054673 -0.0472297 -0.1118822 -0.0243831 0.0302657 -0.0246824 -0.0779061 -0.0542238 -0.1585089 0.0047633 0.0670623 -0.0051445 0.056393 -0.1507382 0.0373507 -0.0083439 0.0606236 0.0236728 0.5367533 0.0584552 0.3442664 -0.0319112 0.2979916 -0.0464563 0.1185516 0.1229548 0.9173004 0.7698545 0.1365153 0.3876131 0.1036933 0.3784518 0.1175115 0.4521423 0.163067 0.7107648 0.5101584 -0.120615 -0.3065096 -0.0683243 0.3701571 0.3259308 -0.2639088 0.2795998 0.762577 -0.0802913 0.0019178 0.116402 0.0303591 0.0672651 -0.06213 0.0850982 -0.0186812 -0.1428296 -0.0260174 -0.1128362 0.0603189 -0.1112312 -0.0850027 0.053781 0.0142384 -0.0188192 0.0083314 0.0085276 0.0879918 -0.0456459 0.0599534 -0.1416957 0.0273063 -0.0315616 -0.0222535 0.0301034 -0.0953724 0.0588694 -0.1279598 0.0185345 0.0656462 0.003193 -0.0640283 -0.0027093 -0.0821666 0.4250567 -0.1705216 -0.149472 -0.1032046 0.3863087 -0.0086992 -0.1831062 0.0955311 0.4804248 -0.0734182 0.1458259 0.0454033 0.1158579 -0.26187 0.0030946 0.0298162 0.0450664 -0.0292557 -0.0634692 -0.0375276 -0.0824894 -0.0017429 0.029992 -0.0368123 -0.0984316 -0.0600499 -0.1294822 0.8077396 -0.000259 0.0507579 0.0266104 0.89274 0.2573836 0.0915903 0.2127329 1.3679804 -0.5777081 0.1798497 0.2499653 0.2147705 -0.5794391 -0.0573117 0.2194409 -0.037913 -0.5156845 0.1014063 -0.0141148 -0.111949 0.0158365 0.2889493 0.0290704 -0.0520884 -0.0386259 0.0524183 0.1513045 -0.1019236 0.0624279 -0.1918257 0.1430904 0.0356347 0.1229531 -0.0114643 0.111921 -0.555933 0.1979685 0.2711428 0.1961682 -0.495246 -0.2662372 0.3408796 -0.3181329 -0.9345502 -0.8964301 -0.2680395 -0.4225875 -0.1805581 -0.4205208 -0.0975488 -0.4767918 -0.1819181 -0.7305469 unknown
polarizability: 138.2789299|3.5407618|128.960097|-9.4820951|7.298911|156.6020327 unknown
InChI: InChI=1/C7H14F2NO.Cs/c8-5-7(11,6-9)3-1-2-4-10;/h1-6,10H2;/q-1;+1/rC7H14CsF2NO/c9-5-7(3-1-2-4-11)6-10-8-12-7/h1-6,11H2
charge 0 multiplicity 1
26 atoms
O  -1.28534035 -0.3146101 -1.18433472
C  -1.38735143 -0.74170471 -3.59107036
C  -0.1968123 0.14790406 -3.95318929
H  -2.09719306 -0.78026836 -4.42564921
H  -1.02332198 -1.76395926 -3.44123536
H  0.40807663 0.28681906 -3.05265458
H  -0.54394098 1.14216717 -4.25793543
C  0.66791789 -0.43578007 -5.07305401
H  0.04758119 -0.61681662 -5.96033909
H  1.06230918 -1.41010114 -4.76774846
C  -2.11514584 -0.35608776 -2.26551661
C  -3.18120583 -1.42722461 -1.970841
C  -2.81915489 0.99484798 -2.4896761
H  -3.74571189 -1.16621243 -1.07468511
H  -2.09710053 1.77156039 -2.74097054
H  -2.69585544 -2.39462122 -1.8385689
H  -3.61534461 0.95760798 -3.2357033
C  1.83734224 0.46202467 -5.4645756
H  1.44900372 1.45117104 -5.75442951
H  2.47946963 0.61930493 -4.5925491
Cs -1.45702167 1.03859613 1.17190676
N  2.6552313 -0.1621059 -6.51407995
H  2.10380652 -0.28818395 -7.35726217
H  3.4345942 0.43758048 -6.76352488
F  -3.44481035 1.43441247 -1.27595193
F  -4.14359829 -1.58743465 -3.01608751
