program: Gaussian 16
title: Title Card Required
version: ES64L-G16RevB.01
method: RB3LYP
basis: TZVP
operation: Freq
keyword: #PGeom=AllCheck
keyword: Guess=TCheck
keyword: SCRF=Check
keyword: GenChk
keyword: RB3LYP/TZVP
keyword: Freq
converged: YES YES NO NO
title: Mulliken charges:
elementType: Cu N N C H C C H C H C C C H H H C H C H C H C C H C H H H C H H H C C C H C H C H C C H C H H H C H H H C H C H H H C H H H C H H H C C H H H H C H H C H H C N
charge: -0.087397 0.008135 0.025721 -0.154164 0.158524 0.110652 -0.041713 0.141551 -0.039803 0.142869 -0.229673 0.216808 -0.386041 0.132946 0.125850 0.125457 -0.268501 0.128109 0.004920 0.119574 -0.269366 0.127924 0.217767 -0.153796 0.158214 -0.388657 0.128549 0.128937 0.143745 -0.386648 0.125628 0.125588 0.132818 -0.187728 0.205524 -0.274569 0.128615 0.010605 0.120190 -0.273476 0.128698 0.204805 -0.163674 0.164106 -0.385043 0.124756 0.133010 0.124662 -0.398627 0.128245 0.132697 0.150148 -0.164027 0.165224 -0.385775 0.124951 0.132822 0.124372 -0.400250 0.150828 0.133115 0.128342 -0.388633 0.143529 0.129078 0.128547 -0.421254 -0.221789 0.061019 0.096389 0.097365 0.061195 -0.231536 0.117295 0.117583 -0.274859 0.160332 0.160318 0.027354 -0.169006
chargesum: -0.00000
title: Mulliken charges with hydrogens summed into heavy atoms:
elementType: Cu N N C C C C C C C C C C C C C C C C C C C C C C C C C C C C C C C C N
charge: -0.087397 0.008135 0.025721 0.004360 0.110652 0.099838 0.103066 -0.229673 0.216808 -0.001788 -0.140392 0.124494 -0.141442 0.217767 0.004418 0.012574 -0.002615 -0.187728 0.205524 -0.145954 0.130795 -0.144778 0.204805 0.000432 -0.002615 0.012463 0.001197 -0.003630 0.012035 0.012521 -0.299040 -0.028035 0.003342 0.045791 0.027354 -0.169006
chargesum: 0.00000
polarizability: 4.80966786e+02 -4.08931599e+01 4.86698668e+02 -1.03478868e+01 -4.08473469e+01 4.69271414e+02
1716.lowfreq: -5.3966 0.0029 0.0039 0.0049 4.6199 5.9950 10.4967 17.7900 18.3805
frequency: 10.3542 17.7340 18.3764 24.8948 36.5544 43.3562 46.6071 50.2056 52.2729 53.2799 68.7630 72.4875 75.0544 78.5899 79.2034 92.7618 106.9964 122.2329 124.4625 131.8517 134.2827 137.3520 148.9589 164.2422 177.4852 180.1347 202.7910 236.2892 238.5501 243.3269 249.0366 253.2532 265.3029 267.1472 272.7289 275.9859 277.3110 278.0326 287.0909 289.9265 299.7528 309.7173 312.5472 317.0060 327.2177 331.6572 344.7135 361.7731 397.1312 416.8024 423.5926 436.1308 451.4529 456.3478 463.3228 487.7844 533.9528 534.8667 539.9649 558.2140 596.1106 596.5024 597.6206 606.0035 609.8583 632.7412 650.2883 650.9826 651.6215 678.9654 710.1770 747.2594 748.0700 750.7230 761.7787 765.4077 776.1300 811.4438 812.1079 821.5651 822.3826 832.7100 856.9561 896.9512 897.7475 923.6355 925.1745 925.5438 946.9137 947.5070 949.2362 950.7945 953.4482 955.1083 971.3303 973.7968 974.3908 975.2177 976.7762 985.4624 985.8210 995.2559 995.5885 1002.4421 1011.1814 1031.9049 1068.2821 1070.7990 1087.5723 1090.4640 1108.2587 1109.5540 1122.4944 1122.7322 1124.1582 1126.2379 1127.1982 1128.3984 1147.3284 1154.5721 1155.3384 1179.7586 1181.6359 1197.5605 1198.7454 1214.8004 1216.8168 1237.0797 1258.4911 1262.4011 1273.8662 1274.2203 1282.9972 1284.7886 1293.9118 1305.1471 1306.6931 1320.4101 1339.1619 1339.8055 1344.4537 1345.5219 1346.2921 1346.5348 1349.7295 1360.7764 1370.1204 1378.3812 1394.8207 1396.8915 1406.5474 1409.7319 1410.1845 1412.1698 1413.1552 1431.2536 1431.6604 1433.4151 1433.7842 1436.0660 1460.5700 1464.9099 1484.5382 1485.5298 1485.6815 1488.3447 1490.0381 1490.5138 1491.2407 1492.9326 1494.7291 1496.5529 1499.0233 1501.8029 1502.5923 1503.2321 1506.3118 1508.0382 1509.4874 1510.9225 1512.1267 1514.4160 1515.1466 1517.4273 1586.7579 1630.6312 1630.9853 1631.6414 1631.8145 2351.0242 2958.9178 2980.3503 2990.2291 3015.4290 3020.7534 3020.9165 3022.8150 3022.8526 3028.9876 3029.1628 3029.8348 3030.0746 3030.9241 3040.5831 3063.0774 3063.5756 3065.0208 3065.7338 3068.4688 3085.0971 3088.0606 3088.1848 3089.1009 3089.1971 3091.5992 3091.8244 3092.9236 3093.3643 3093.4987 3093.7408 3094.3264 3094.4732 3100.3284 3100.8896 3101.2265 3102.1331 3172.0141 3172.5820 3188.1811 3190.1981 3196.6865 3197.8807 3275.8978 3294.6194
redmass: 5.1648 4.5665 5.3171 3.9527 2.4507 4.1746 4.5925 3.0455 4.0213 3.2722 3.2315 2.6755 2.9263 4.3766 3.4992 4.1993 5.9353 2.1881 4.2466 3.0583 3.0284 2.9763 5.4488 3.3935 3.7321 4.0701 3.5695 3.2881 1.1446 1.1190 1.2028 1.2368 1.5133 1.6537 2.1027 1.4332 1.7436 1.3415 1.6889 1.6156 2.2651 2.8881 3.0442 4.1156 3.1753 3.0659 5.2353 4.3230 3.3964 4.9272 3.1773 2.9890 3.2515 2.5685 3.0525 3.7987 4.8165 4.4089 6.6174 3.9941 3.2757 2.9941 2.4095 3.3899 1.3953 2.8950 3.9354 4.1113 3.2314 4.5078 3.2224 4.0716 1.4720 1.2489 4.4161 2.9326 3.0248 1.7821 1.8145 3.7257 3.7499 1.2946 1.3777 2.6073 2.6142 1.4052 1.4081 5.8524 1.5270 1.5784 1.2007 1.2022 1.6402 1.5862 2.9898 1.8560 1.5502 1.5057 1.5016 1.2985 1.2910 4.4769 1.2339 3.6707 3.2771 3.1112 1.9936 2.0268 1.4916 1.4991 1.9619 2.0373 2.2622 1.6465 2.2910 2.2069 2.3508 2.3217 1.6135 1.3096 1.6742 2.0332 2.0418 1.7374 1.7279 1.3164 1.3116 2.6998 1.3227 2.9550 4.0460 1.2803 2.1176 2.1655 3.3401 3.5953 3.4070 1.1294 2.0676 1.0679 1.6373 1.3217 1.4794 1.4362 1.3349 2.7305 1.5666 1.3856 1.4275 1.4207 2.3168 1.2125 1.2128 1.2133 1.3016 1.2189 1.2192 1.2144 1.2189 3.0801 1.0838 1.0860 1.0667 1.0461 1.0890 1.1676 1.0599 1.0476 1.0491 1.3348 1.1215 1.6990 1.3869 1.6383 1.1007 1.4189 1.0697 1.0710 1.0724 1.0858 1.1331 1.4431 1.1430 1.3291 4.8950 6.6126 5.1409 6.4783 5.2179 12.6102 1.0559 1.0982 1.0585 1.1002 1.0346 1.0346 1.0347 1.0352 1.0351 1.0351 1.0352 1.0352 1.0583 1.0585 1.0859 1.1039 1.0862 1.0866 1.0871 1.1052 1.1026 1.1025 1.1024 1.1024 1.1026 1.1025 1.1024 1.1024 1.1025 1.1025 1.1026 1.1025 1.0990 1.0987 1.0989 1.0980 1.0867 1.0870 1.0902 1.0902 1.0956 1.0954 1.0920 1.1104
irintensity: 0.0451 0.2376 0.4478 0.0443 9.4804 0.1837 0.2037 0.0252 0.0044 0.0949 0.3449 0.0363 0.0573 1.1297 0.1032 1.8031 4.7892 1.5677 1.4358 0.0392 0.5805 0.0351 0.6810 0.0520 2.8290 2.6941 2.2341 2.2164 0.0680 0.9247 0.4899 0.3595 0.7617 1.0828 1.1674 0.3044 2.9318 0.6620 0.0635 3.1736 0.9617 0.1606 0.0358 1.4012 1.0615 0.3704 0.9337 9.3363 0.4109 0.2033 0.9481 0.0108 9.3750 0.0373 6.7293 0.1052 1.8791 0.0156 0.5401 3.3246 1.0250 1.4998 5.2105 10.3581 27.9587 0.4644 1.4527 3.3404 5.9997 0.0014 15.8701 5.0743 30.9207 7.9107 3.5406 28.5031 21.9116 31.8973 34.7178 0.3781 3.8306 6.1442 0.0020 0.6001 0.4139 1.5337 1.0059 5.8232 0.7435 3.5378 2.9264 2.6609 0.9139 14.5271 16.4683 5.8484 1.3127 0.4225 1.3879 0.3838 0.1611 0.4341 4.1392 9.5069 4.7284 4.8237 5.3554 0.9209 0.6592 26.8854 10.3837 6.0694 1.5479 11.3527 4.8098 6.8815 0.5712 9.7293 11.6326 2.0378 0.9156 1.3275 1.1936 0.0734 3.2455 6.4364 9.0060 19.4200 3.4453 1.6214 0.4921 0.0353 4.0200 7.0021 23.3871 2.8000 5.3009 2.1620 3.2824 0.2649 2.5621 0.1448 4.0281 9.1783 1.0027 23.5176 42.3090 2.2769 0.0974 9.2979 2.3927 0.1777 0.1958 0.9236 19.3441 2.5178 3.7846 10.2580 3.3986 96.3362 5.4733 3.2200 4.8611 0.6621 19.2074 32.9862 1.4851 0.1921 0.1616 3.0305 0.7488 15.7453 0.0343 1.8978 9.9727 23.1912 25.4566 5.3335 16.0678 14.5181 27.6845 1.7194 8.9784 7.5873 2.0829 0.9212 1.6244 12.6672 2.8951 74.8564 73.9182 25.7013 51.6072 34.3068 3.2436 3.0806 51.3915 46.7213 47.8344 23.2268 65.2458 26.8988 13.1420 28.8533 0.7107 12.5848 0.4128 0.4477 0.3755 38.1558 1.8289 3.2891 2.3993 3.0840 2.9397 2.5612 11.1757 46.7177 28.5019 19.4048 148.0871 15.2238 24.3739 111.1683 77.9886 73.1964 3.1503 4.3253 12.2321 12.4762 18.6359 18.0851 9.8525 2.2384
temp: 298.150 k
press: 1.00000 atm
elementType: 29 7 7 6 1 6 6 1 6 1 6 6 6 1 1 1 6 1 6 1 6 1 6 6 1 6 1 1 1 6 1 1 1 6 6 6 1 6 1 6 1 6 6 1 6 1 1 1 6 1 1 1 6 1 6 1 1 1 6 1 1 1 6 1 1 1 6 6 1 1 1 1 6 1 1 6 1 1 6 7
symmnumber: 1
zpe: 1815965.5 jmol-1
zpe.correction: 0.691665 hartree
zpe.thermalcorrener: 0.731532 hartree
zpe.thermalcorrenthalpy: 0.732476 hartree
zpe.thermalcorrgfe: 0.615784 hartree
zpe.sumelectzpe: -3050.649560 hartree
zpe.sumelectthermal: -3050.609694 hartree
zpe.sumelectthermalent: -3050.608749 hartree
zpe.sumelectthermalfe: -3050.725441 hartree
dipole: 9.2634 2.0757 9.6597
dipole: 13.5436
quadrupole: -199.4308 -216.1703 -169.8910
quadrupole: 2.4728 31.9150 5.7889
quadrupole: -4.2667 -21.0062 25.2730 2.4728 31.9150 5.7889
hfenergy: -3051.3412252 hartree
pointgroup: C01 [X(C32H44Cu1N3)]
dipole: 3.6445028 0.8166349 3.8004293 debye
polarizability: 480.9667857|-40.8931599|486.6986681|-10.3478868|-40.8473469|469.2714144 unknown
InChI: InChI=1/C27H36N2.C5H8N.Cu/c1-18(2)22-11-9-12-23(19(3)4)26(22)28-15-16-29(17-28)27-24(20(5)6)13-10-14-25(27)21(7)8;1-2-3-4-5-6;/h9-16,18-21H,1-8H3;1-4H2;/rC32H44CuN3/c1-22(2)26-14-12-15-27(23(3)4)30(26)35-20-21-36(32(35)33-18-10-9-11-19-34)31-28(24(5)6)16-13-17-29(31)25(7)8/h12-17,20-25H,9-11,18H2,1-8H3
charge 0 multiplicity 1
80 atoms
Cu 2.8896871 -0.8926591 4.25419604
N  4.26596904 1.06406923 5.94099963
N  5.01491897 -0.88325588 6.40160541
C  3.33832323 -2.51170253 8.1009788
H  3.49429439 -1.43347299 8.15193904
C  4.12477481 -0.2448037 5.59960034
C  5.22142265 1.23777004 6.93154756
H  5.46750617 2.20694678 7.32758818
C  5.69580926 0.00480694 7.22365729
H  6.44082895 -0.3232678 7.92645521
C  5.21790342 -2.30749137 6.38371366
C  4.4321292 -3.10486174 7.2266724
C  3.37220137 -3.04281644 9.53910835
H  2.62901 -2.52219002 10.14793598
H  4.35207751 -2.89103208 9.99784969
H  3.1411233 -4.10924636 9.585778
C  4.63831888 -4.48403011 7.17966971
H  4.04495902 -5.13520208 7.80846042
C  5.58182124 -5.03522501 6.32349589
H  5.72416444 -6.10911297 6.29883323
C  6.33405824 -4.2205607 5.48840134
H  7.04972345 -4.66857421 4.81110279
C  6.16659176 -2.83535732 5.49768797
C  6.93123986 -1.95430839 4.5221653
H  6.80662954 -0.91679397 4.83421823
C  6.32806517 -2.08412299 3.11430406
H  6.43790936 -3.10392323 2.73673091
H  6.83067052 -1.40893188 2.41745641
H  5.26282179 -1.8412744 3.11740428
C  8.43675788 -2.24569064 4.5128436
H  8.65671622 -3.24622099 4.13436101
H  8.86497397 -2.16380094 5.51464016
H  8.9521473 -1.53224236 3.86519509
C  3.50240047 2.1181037 5.32586503
C  4.00258349 2.71311504 4.15961323
C  3.23109012 3.71299279 3.56659225
H  3.5809035 4.18965651 2.65975538
C  2.01211008 4.09148752 4.11144678
H  1.42579306 4.86745697 3.633668
C  1.53364374 3.47111348 5.25706288
H  0.57072043 3.76128121 5.65751574
C  2.26663816 2.46578615 5.88845339
C  1.69081969 1.73246832 7.0896406
H  2.475715 1.10507223 7.51294475
C  1.22674225 2.6883355 8.1957188
H  2.03276619 3.35558859 8.50996185
H  0.89742804 2.12043986 9.06931384
H  0.3862033 3.30656832 7.87269585
C  0.5530312 0.80101681 6.64213867
H  -0.27630835 1.37328588 6.21894603
H  0.17011763 0.22844763 7.49038454
H  0.89750289 0.09637717 5.88169348
C  5.29286404 2.24714815 3.50391492
H  5.79608254 1.56641719 4.19104603
C  6.25865412 3.40448436 3.22034302
H  5.85268837 4.10144388 2.4837807
H  7.20032504 3.01918188 2.82164649
H  6.48159609 3.96904886 4.12878855
C  4.97840941 1.45481509 2.22503195
H  4.32166061 0.60834895 2.43866186
H  5.89750551 1.06965534 1.77691301
H  4.48188246 2.08788641 1.48540327
C  1.96430803 -2.74583554 7.45249659
H  1.9299514 -2.33546803 6.44057207
H  1.17574697 -2.27067412 8.04116695
H  1.74249018 -3.814159 7.38821747
C  1.5557194 -1.25896544 2.8532991
C  0.91193371 0.05296345 2.38106688
H  0.76614687 -1.93655469 3.21192971
H  1.68663568 0.73595479 2.01148624
H  0.45393584 0.57042201 3.23298354
H  2.00386903 -1.77015289 1.98787699
C  -0.14973849 -0.11341748 1.28706738
H  0.2926463 -0.6026826 0.41481777
H  -0.94935815 -0.76773249 1.64532404
C  -0.75152582 1.2408266 0.86121566
H  -1.20492127 1.73936746 1.72291749
H  0.03597132 1.90302851 0.48973923
C  -1.76674038 1.1191684 -0.17647551
N  -2.56663623 0.99919215 -0.99712505
