program: Gaussian 09
title: Title
version: ES64L-G09RevD.01
method: RB3LYP
basis: TZVP
operation: Freq
keyword: #P
keyword: Geom=AllCheck
keyword: Guess=TCheck
keyword: SCRF=Check
keyword: GenChk
keyword: RB3LYP/TZVP
keyword: Freq
converged: YES YES YES YES
title: Mulliken charges:
elementType: Cu N N C H C C H C H C C C H H H C H C H C H C C H C H H H C H H H C C C H C H C H C C H C H H H C H H H C H C H H H C H H H C H H H O C C H H H H C H H C C C C H H C N F F F F F F
charge: 0.040411 -0.000882 0.018326 -0.162893 0.158363 0.147439 -0.028602 0.147747 -0.042056 0.146275 -0.248157 0.225261 -0.388652 0.134556 0.123751 0.128033 -0.272573 0.130442 0.012124 0.122605 -0.272621 0.131512 0.237016 -0.163027 0.163604 -0.392125 0.139635 0.138483 0.120095 -0.380920 0.127935 0.129163 0.134755 -0.190605 0.212629 -0.254321 0.128561 0.005563 0.120817 -0.260328 0.128386 0.205837 -0.179554 0.160158 -0.391031 0.120509 0.132582 0.128768 -0.396144 0.131007 0.134730 0.158612 -0.160893 0.149775 -0.379029 0.124932 0.135157 0.132462 -0.361381 0.104963 0.130699 0.130100 -0.387452 0.149176 0.131514 0.131969 -0.517629 -0.334734 -0.135936 0.155097 0.153041 0.090213 0.134850 -0.305738 0.140392 0.146962 0.018509 0.444388 0.414675 -0.235262 0.177750 0.140058 0.009822 -0.152604 -0.158313 -0.167222 -0.165768 -0.151018 -0.164875 -0.169852
chargesum: 0.00000
title: Mulliken charges with hydrogens summed into heavy atoms:
elementType: Cu N N C C C C C C C C C C C C C C C C C C C C C C C C C C C O C C C C C C C C N F F F F F F
charge: 0.040411 -0.000882 0.018326 -0.004531 0.147439 0.119146 0.104219 -0.248157 0.225261 -0.002312 -0.142131 0.134730 -0.141110 0.237016 0.000577 0.006089 0.010933 -0.190605 0.212629 -0.125759 0.126380 -0.131942 0.205837 -0.019397 -0.009171 0.028205 -0.011118 0.013523 0.004381 0.025207 -0.517629 -0.026595 0.089126 -0.018384 0.018509 0.444388 0.414675 0.082545 0.009822 -0.152604 -0.158313 -0.167222 -0.165768 -0.151018 -0.164875 -0.169852
polarizability: 4.60452846e+02 -4.19435382e+01 5.10625776e+02 -7.38409482e+00 7.84326545e+00 5.54347557e+02
1716.lowfreq: -9.9745 0.0048 0.0051 0.0056 3.2138 8.8331 17.0994 19.9223 26.6090
frequency: 17.0909 19.2223 26.4430 30.2917 32.8074 35.5937 41.5011 45.5037 49.4977 54.2149 56.2847 60.1635 62.3865 68.6274 74.8648 77.5352 83.7748 90.3319 93.3403 100.4381 105.2419 112.9931 125.7210 130.6340 132.8311 137.2225 139.8900 147.9258 165.1137 168.8154 172.7154 175.5293 180.2117 207.7252 226.9609 237.9661 243.2611 245.4305 249.1676 251.8669 260.0735 263.8041 267.5237 269.1546 274.4036 278.9394 286.4689 291.1477 294.6076 300.0522 303.4614 313.4711 315.6094 318.1290 321.2878 322.6566 329.5093 334.2206 358.2308 359.1981 400.2177 414.4724 422.7964 425.0971 434.7635 436.5111 453.5909 455.6184 463.7001 488.2226 513.4722 528.1537 535.0967 535.3999 536.5457 556.7175 558.4967 563.3013 593.9187 597.7985 599.8605 630.4681 638.1026 646.7339 651.3962 653.3781 679.3365 682.4621 715.1778 715.9390 747.2218 751.5519 752.2119 759.6747 761.9951 764.5704 775.1214 805.1560 810.0876 810.7433 822.3508 823.1614 860.8592 897.7728 899.1546 910.0238 922.7303 924.4197 927.9268 946.0859 946.5371 947.1225 949.0203 951.4924 952.3867 958.7441 972.3981 975.2540 975.6164 979.7564 982.4530 986.2128 987.7104 998.3759 1005.4486 1033.1424 1067.5861 1069.8975 1070.6119 1073.2228 1084.2020 1088.4235 1091.5226 1108.7146 1110.7102 1118.2864 1124.5776 1125.6410 1126.4134 1129.1832 1130.6820 1133.3646 1146.2966 1148.1485 1155.9814 1169.2065 1178.7308 1181.0608 1182.0739 1197.6684 1199.1454 1217.3254 1218.4107 1229.3514 1232.7482 1237.0345 1261.7825 1264.7622 1275.4006 1283.7828 1285.1594 1285.9901 1297.6623 1306.4246 1306.9337 1313.4961 1339.6328 1343.5586 1344.4316 1349.6039 1351.6691 1353.2109 1355.6117 1369.8576 1370.1640 1372.8478 1394.8128 1396.3554 1397.2933 1405.0932 1407.8904 1408.4267 1410.3743 1411.2671 1425.6745 1427.8822 1429.0677 1431.2512 1431.6893 1438.7714 1468.8675 1481.0004 1481.9693 1484.3862 1484.8961 1486.7257 1488.5519 1489.1583 1490.9334 1492.9694 1493.3952 1495.2031 1497.9308 1498.4181 1500.8895 1503.5959 1504.4598 1505.6433 1506.6528 1506.9700 1510.5971 1513.1759 1513.9037 1516.7174 1587.2666 1630.5151 1631.4382 1631.9233 1632.8752 2358.8412 3025.1761 3027.1846 3027.4295 3028.0444 3031.4409 3032.2556 3032.5690 3033.9628 3035.9042 3045.0061 3052.5757 3056.4920 3060.4289 3066.4074 3067.9040 3068.9674 3070.2168 3083.8128 3090.4218 3090.5007 3091.2089 3091.6402 3093.4697 3094.8726 3096.3911 3097.0763 3098.2194 3099.2175 3100.7566 3101.1453 3103.0778 3103.8504 3104.6516 3107.7914 3113.3268 3117.8591 3174.7038 3175.7106 3190.0221 3192.3736 3198.4141 3200.3573 3277.0973 3295.6184
redmass: 7.3357 6.2326 4.3538 5.1962 5.9587 6.8212 8.4262 4.4559 5.2962 3.7509 5.2384 4.4370 3.8560 4.1439 3.3461 4.4814 3.6270 3.7378 3.7619 2.6849 4.6900 4.4226 8.7730 3.5517 3.4512 3.2969 4.1990 3.8095 3.4578 5.8124 6.5039 3.6896 3.7077 5.0005 3.5874 1.1515 1.3731 2.5886 1.2023 1.4291 2.1386 1.4357 1.9808 1.6681 1.6850 1.4516 1.8889 6.6842 2.1137 2.3073 2.4425 2.8634 3.5599 5.4922 4.3089 5.6011 3.3809 3.3953 6.1225 4.9208 3.3488 4.8870 4.5542 3.8733 5.3313 3.3270 2.9763 2.6043 3.2391 3.7894 12.6809 16.6712 6.9934 4.9173 6.2573 10.0717 4.4384 8.3677 3.0536 3.0887 3.1134 3.0169 5.7108 3.6965 4.0626 3.4384 4.4549 5.3361 5.5095 4.7945 5.1302 2.1596 1.6661 1.7517 4.4663 2.7495 3.0704 1.4546 1.7755 1.8593 3.7284 3.7406 1.3803 2.5916 2.6007 2.9129 1.3979 1.4051 3.1869 1.5358 1.2911 1.4416 1.2308 3.6270 1.8694 1.4416 4.0025 1.5767 1.5177 1.5141 1.4759 1.3511 1.2928 4.4791 3.9347 3.1446 2.8572 3.1450 2.7915 2.0100 10.8540 1.5137 1.5202 1.6934 2.4458 2.8388 2.3641 2.4055 4.4469 2.2372 2.3548 2.2215 8.9689 1.6297 1.7734 10.8872 2.0425 2.0659 1.5086 1.7766 1.7712 1.3053 1.2850 9.9649 3.1148 2.5964 2.9454 2.8060 3.5641 2.1217 2.1644 1.5979 3.8393 3.5228 3.5047 1.3379 1.9315 1.3544 1.1999 1.5404 1.3642 1.3541 1.2942 1.7292 1.5208 1.8578 1.4208 1.4359 1.3929 2.3904 1.2127 1.2270 1.2114 1.2896 1.4176 1.2158 1.2290 1.2156 1.2214 3.1568 1.0876 1.0610 1.0431 1.0768 1.0788 1.2055 1.0508 1.0503 1.2492 1.1184 1.2371 1.3435 1.2179 1.5673 1.0741 1.2530 1.1456 1.0825 1.1707 1.1075 1.2128 1.2885 1.4130 1.3086 4.8802 5.7307 5.6997 5.7159 5.9126 12.6158 1.0343 1.0361 1.0348 1.0348 1.0354 1.0354 1.0358 1.0362 1.0578 1.0583 1.0615 1.0610 1.0849 1.0987 1.0866 1.0862 1.0864 1.1024 1.1025 1.1025 1.1026 1.1024 1.1024 1.1025 1.1019 1.1022 1.1028 1.1018 1.1010 1.1005 1.0988 1.0990 1.0987 1.1045 1.1004 1.0995 1.0869 1.0871 1.0905 1.0904 1.0960 1.0956 1.0922 1.1106
irintensity: 1.3806 0.9651 0.3593 0.2889 0.9064 2.1146 1.0550 0.1338 0.3718 0.0856 3.2751 1.5975 0.1453 0.2488 0.2262 0.8732 1.1853 2.3730 0.8917 0.4445 1.6632 0.1487 1.6131 0.9664 1.6558 0.0594 3.4828 1.9977 0.4841 2.6308 1.4152 3.1495 3.5601 2.5000 4.2135 0.2703 0.2865 3.8344 0.4144 0.4626 1.2075 0.6722 0.4311 3.1990 0.9736 0.5273 0.5022 2.3340 1.5795 1.4383 0.9826 0.0556 0.4082 2.1255 1.2462 1.2068 2.8659 1.5606 0.5295 3.2055 0.2883 0.6400 3.0508 7.2741 8.8876 1.2191 4.5059 1.1560 7.3954 0.1225 10.2056 5.7520 3.7006 0.7471 1.3597 1.3215 2.6163 3.2891 0.0101 0.0064 0.0687 0.1251 3.0994 3.9501 2.3605 4.4677 0.0724 28.0035 43.3411 6.2526 1.6761 4.4838 39.1716 5.2987 0.4643 24.9907 23.7773 0.0794 31.6748 33.5271 0.3035 3.3606 0.0948 0.2946 0.7583 46.9349 1.3548 0.9992 24.5034 2.4359 1.8609 3.4881 1.3664 62.0371 10.3928 10.5111 16.4958 1.9278 0.6533 0.7211 1.1894 0.5788 0.4493 4.0259 61.3237 35.6626 23.5285 37.3247 49.6783 1.9311 7.8769 0.1775 26.0667 4.6680 5.3598 67.1457 2.2026 8.3257 26.5762 3.1537 8.3271 5.8836 689.9322 26.3023 3.7515 198.7024 1.5994 0.9002 94.6203 0.1447 7.6374 6.5505 8.3484 229.0763 206.0486 25.6727 3.3274 99.9361 2.3379 2.8614 7.7365 22.7091 19.4423 0.0731 8.7002 21.9078 1.4287 2.1432 5.7223 0.8601 2.6269 0.1358 4.8350 48.4294 34.2437 8.3709 0.1551 13.3714 0.6726 5.3320 1.0879 2.4947 1.9702 25.2597 1.8322 4.7506 3.8274 12.6611 5.1780 85.4410 5.6718 0.0588 3.5640 1.3819 17.2930 30.9301 1.4887 2.3295 8.7747 1.2146 12.5437 4.9813 3.9568 10.1158 16.3825 19.1064 6.2314 11.6972 1.6363 20.2224 36.0486 1.9281 2.3103 10.0978 4.1902 1.6162 6.8226 1.7593 7.7492 45.0866 22.4640 57.2089 15.4910 37.7454 23.7875 17.5252 54.7109 35.2694 11.2068 10.4937 3.1216 56.3898 2.7600 3.6326 1.9620 0.4282 1.5953 7.0593 13.4971 0.0601 11.2423 1.4779 13.0925 42.4290 53.4581 44.7623 0.8037 27.6821 29.7473 54.4436 106.7298 30.6884 79.3792 28.7738 27.5072 34.3713 2.7582 3.2607 11.2948 10.2499 17.6746 13.6027 11.3317 4.5288
temp: 298.150 k
press: 1.00000 atm
elementType: 29 7 7 6 1 6 6 1 6 1 6 6 6 1 1 1 6 1 6 1 6 1 6 6 1 6 1 1 1 6 1 1 1 6 6 6 1 6 1 6 1 6 6 1 6 1 1 1 6 1 1 1 6 1 6 1 1 1 6 1 1 1 6 1 1 1 8 6 6 1 1 1 1 6 1 1 6 6 6 6 1 1 6 7 9 9 9 9 9 9
symmnumber: 1
zpe: 1931190.2 jmol-1
zpe.correction: 0.735552 hartree
zpe.thermalcorrener: 0.784293 hartree
zpe.thermalcorrenthalpy: 0.785237 hartree
zpe.thermalcorrgfe: 0.650955 hartree
zpe.sumelectzpe: -3839.600276 hartree
zpe.sumelectthermal: -3839.551534 hartree
zpe.sumelectthermalent: -3839.550590 hartree
zpe.sumelectthermalfe: -3839.684872 hartree
dipole: 10.9269 5.2253 3.2402
dipole: 12.5379
quadrupole: -212.6664 -275.3291 -301.4374
quadrupole: 5.2691 50.8210 -1.6472
quadrupole: 50.4779 -12.1848 -38.2931 5.2691 50.8210 -1.6472
hfenergy: -3840.3358272 hartree
pointgroup: C01 [X(C35H44Cu1F6N3O1)]
dipole: 4.2989796 2.0557862 1.2747852 debye
polarizability: 460.4528464|-41.9435382|510.625776|-7.3840948|7.8432654|554.3475567 unknown
InChI: InChI=1/C27H36N2.C8H8F6NO.Cu/c1-18(2)22-11-9-12-23(19(3)4)26(22)28-15-16-29(17-28)27-24(20(5)6)13-10-14-25(27)21(7)8;9-7(10,11)6(16,8(12,13)14)4-2-1-3-5-15;/h9-16,18-21H,1-8H3;1-4H2;/q;-1;+1/rC35H44CuF6N3O/c1-22(2)26-14-12-15-27(23(3)4)30(26)44-20-21-45(31-28(24(5)6)16-13-17-29(31)25(7)8)32(44)36-46-33(34(37,38)39,35(40,41)42)18-10-9-11-19-43/h12-17,20-25H,9-11,18H2,1-8H3
charge 0 multiplicity 1
90 atoms
Cu 3.27015906 -0.44705857 3.46565286
N  5.27393761 1.6641437 3.60720725
N  6.20590973 -0.26403171 3.62182243
C  6.0344659 -1.62815072 6.1699901
H  6.08336646 -0.55616045 5.97654812
C  4.99199121 0.33703021 3.53188773
C  6.63539268 1.88564804 3.75156994
H  7.04723466 2.87584197 3.83172941
C  7.22487743 0.66792905 3.7583751
H  8.25624054 0.3769941 3.84836264
C  6.3856975 -1.69293447 3.63560865
C  6.32064669 -2.3588766 4.86709976
C  7.07546854 -1.93791788 7.2535914
H  6.8797881 -1.3365794 8.14465401
H  8.08834956 -1.71391835 6.91101632
H  7.04800222 -2.98718891 7.55520601
C  6.47484181 -3.74575545 4.85378366
H  6.42171757 -4.29796001 5.78328711
C  6.67967473 -4.42946562 3.66393016
H  6.79118141 -5.50710783 3.67426515
C  6.73208905 -3.74246143 2.45857192
H  6.8772045 -4.29325843 1.53840857
C  6.58608174 -2.35586468 2.41696191
C  6.57039805 -1.61534495 1.0889306
H  6.69616967 -0.55150155 1.29371859
C  5.20485707 -1.79070532 0.40450309
H  5.02191116 -2.83958165 0.15871981
H  5.16862245 -1.21433659 -0.52281067
H  4.39521776 -1.45513216 1.05586005
C  7.71373675 -2.03501524 0.15739982
H  7.61882088 -3.07392281 -0.16522291
H  8.68579056 -1.92207607 0.64269068
H  7.71217255 -1.41550217 -0.74259693
C  4.25889724 2.68727411 3.58813771
C  3.96773221 3.31563732 2.36801193
C  2.95158059 4.26969018 2.36571121
H  2.6866661 4.76968587 1.44352792
C  2.25739772 4.57532812 3.5292157
H  1.46373411 5.31239908 3.50419798
C  2.56480891 3.9336998 4.71877357
H  2.004709 4.17146813 5.61395719
C  3.57499579 2.97213455 4.77711788
C  3.87614574 2.26284867 6.08855325
H  4.69797056 1.56671427 5.9196477
C  4.33305712 3.25219121 7.16985727
H  5.20303614 3.82649653 6.84237535
H  4.60566685 2.71687245 8.08276612
H  3.54174123 3.96052367 7.42528652
C  2.67061513 1.43709701 6.56042026
H  1.81094732 2.07484649 6.77673062
H  2.91876216 0.89052149 7.47323324
H  2.36176912 0.71182514 5.80628689
C  4.66054936 2.90505108 1.07696253
H  5.61505526 2.44394109 1.33553034
C  4.96909327 4.08520703 0.15005772
H  4.06085505 4.54139281 -0.24927971
H  5.56085491 3.74450719 -0.70277575
H  5.53690404 4.86265153 0.66594987
C  3.81830697 1.84003695 0.35504984
H  3.63815498 0.98219543 1.00322302
H  4.32920297 1.49261991 -0.54648795
H  2.84848627 2.24966165 0.06407864
C  4.61193603 -1.94002908 6.65933068
H  3.86453818 -1.68093002 5.90676209
H  4.38665153 -1.37502765 7.56681424
H  4.49831058 -3.00254909 6.88698831
O  1.58943706 -1.22068586 3.60071808
C  0.12999417 -1.39602839 1.65522848
C  1.0718576 -0.77880174 0.62413077
H  -0.90966254 -1.23348384 1.36304985
H  0.29839732 -2.47361466 1.68461561
H  2.08649272 -0.77128114 1.02896087
H  0.8010221 0.26198951 0.43517912
C  1.06852367 -1.55126384 -0.69343182
H  0.0557606 -1.60961919 -1.10087103
H  1.40363298 -2.5776369 -0.52351783
C  0.36410435 -0.91532059 3.11640857
C  -0.67643457 -1.66665272 4.01688361
C  0.07192484 0.62487194 3.21793694
C  1.99386137 -0.87937705 -1.72400648
H  1.64665015 0.13323143 -1.94630009
H  3.00341769 -0.78726782 -1.31631233
C  2.08239297 -1.61698096 -2.97731894
N  2.14846262 -2.21471965 -3.95941108
F  0.02893522 1.072066 4.48858465
F  1.04542204 1.33526776 2.60051904
F  -1.09446864 0.98643462 2.63024153
F  -0.52947546 -1.39447542 5.32517208
F  -0.53470544 -3.0025417 3.87965634
F  -1.96422942 -1.37802935 3.69478273
