program: Gaussian 09
title: Title Card Required
version: ES64L-G09RevD.01
method: RB3LYP
basis: TZVP
operation: Freq
keyword: #P
keyword: Geom=AllCheck
keyword: Guess=TCheck
keyword: SCRF=Check
keyword: GenChk
keyword: RB3LYP/TZVP
keyword: Freq
converged: YES YES NO NO
title: Mulliken charges:
elementType: Cu N N C H C C H C H C C C H H H C H C H C H C C H C H H H C H H H C C C H C H C H C C H C H H H C H H H C H C H H H C H H H C H H H C H O H C H H C H H C C C C F F H H H H H H C N
charge: -0.006573 0.030007 0.028665 -0.193802 0.172103 0.084512 -0.031898 0.149738 -0.036318 0.149396 -0.232541 0.225191 -0.387107 0.133068 0.124024 0.130311 -0.253413 0.131487 0.021236 0.123473 -0.261436 0.131297 0.223156 -0.165263 0.152280 -0.373967 0.142802 0.131216 0.110664 -0.384802 0.129999 0.126992 0.132952 -0.206402 0.190184 -0.249349 0.131229 -0.038070 0.130014 -0.247044 0.153797 0.192608 -0.148641 0.149852 -0.379484 0.129413 0.136265 0.133908 -0.393221 0.147122 0.139132 0.114555 -0.187607 0.180527 -0.389187 0.128780 0.136076 0.126909 -0.399319 0.121611 0.146407 0.134604 -0.382513 0.120878 0.135549 0.143807 -0.324502 0.049564 -0.425354 0.058984 -0.173694 0.140869 0.130918 -0.304910 0.151597 0.138354 -0.256658 0.203533 -0.013422 -0.000339 -0.272738 -0.274033 0.103902 0.105468 0.097483 0.095168 0.166067 0.179472 0.044053 -0.179618
chargesum: 0.00000
title: Mulliken charges with hydrogens summed into heavy atoms:
elementType: Cu N N C C C C C C C C C C C C C C C C C C C C C C C C C C C C O C C C C C C F F C N
charge: -0.006573 0.030007 0.028665 -0.021699 0.084512 0.117840 0.113077 -0.232541 0.225191 0.000296 -0.121926 0.144709 -0.130139 0.223156 -0.012983 0.010714 0.005141 -0.206402 0.190184 -0.118120 0.091944 -0.093247 0.192608 0.001211 0.020103 0.007587 -0.007080 0.002578 0.003302 0.017722 -0.215954 -0.425354 0.098093 -0.014959 0.088881 0.203533 0.187214 0.201046 -0.272738 -0.274033 0.044053 -0.179618
polarizability: 5.10183062e+02 -3.70421101e+01 5.55870282e+02 -2.99691536e+01 1.07448351e+01 5.03957783e+02
1716.lowfreq: -269.1834 -8.8574 -3.5269 -0.0336 -0.0013 0.0018 11.8187 17.4119 18.0178
frequency: -269.1777 15.2367 17.4291 24.7285 31.4886 35.1034 40.0381 45.8035 50.5806 51.8682 59.4357 61.4122 66.8959 70.1349 77.4696 78.6579 80.1702 81.9413 85.9577 95.6519 98.3797 107.6747 115.9465 120.6971 128.6579 132.3525 139.8063 143.2933 149.2913 156.9338 168.6997 176.8763 182.1796 217.8883 234.7194 236.0327 245.2000 249.4051 251.9841 255.3156 264.2471 267.7946 273.0038 275.6156 279.1552 282.3935 287.6021 289.3019 291.8175 297.4903 311.1968 318.2019 322.4765 325.8665 328.4299 335.3415 353.4430 372.0774 391.6928 402.1727 415.8048 423.2170 432.5260 437.3868 452.9906 457.6505 464.5967 488.9421 534.7810 534.9738 536.0943 558.4350 566.4147 595.9550 597.9078 601.3332 625.9687 633.0405 648.4383 648.9582 654.0338 680.7585 714.7679 747.5154 756.2881 758.7759 761.5474 764.1775 776.4777 813.0371 813.3434 821.6222 821.8993 822.7187 831.8095 867.3938 873.9973 897.2663 898.0421 911.9316 918.7712 923.3503 929.7997 931.9261 945.9401 946.1348 949.1878 949.3937 951.2750 952.1246 955.0736 972.6140 974.5592 974.9170 975.7568 976.3424 979.2170 982.1814 990.3019 996.0207 999.5857 1017.0474 1050.9317 1062.5121 1070.4140 1072.8258 1075.2690 1088.9257 1092.0664 1108.8172 1112.7851 1123.5914 1125.3374 1127.8959 1129.2409 1132.4006 1138.6401 1149.1759 1157.8813 1180.2675 1182.0978 1198.5226 1199.7545 1210.7173 1217.4474 1219.5649 1220.2824 1238.2893 1262.7840 1278.1416 1281.1623 1284.3478 1286.1985 1288.0654 1302.4102 1307.3354 1308.7655 1309.1201 1313.4881 1339.6100 1345.2063 1348.0146 1348.6860 1350.9561 1353.5699 1355.9395 1370.5708 1371.1796 1395.9152 1398.5942 1399.6997 1402.6966 1406.8295 1408.9482 1409.8499 1411.3683 1412.5904 1416.7105 1427.4059 1429.6293 1431.7046 1431.8474 1433.2173 1441.4747 1463.4762 1476.1455 1480.3927 1481.3864 1484.7766 1485.7944 1486.4766 1487.4507 1487.5701 1490.5286 1492.6244 1493.6299 1495.0453 1497.6281 1499.3507 1502.0362 1502.9018 1504.2128 1505.5976 1506.8607 1509.0520 1511.0081 1513.4066 1514.4436 1516.8487 1529.4580 1586.0076 1630.2911 1630.9810 1632.0180 1633.1948 2356.7107 2972.3615 2989.2082 3024.9861 3027.0777 3027.4602 3028.8096 3030.4815 3031.5511 3031.8244 3032.6731 3033.9492 3036.3095 3041.9219 3046.3345 3047.9287 3063.2011 3064.0699 3068.0452 3070.4442 3070.5829 3089.9619 3091.2313 3091.5907 3091.8469 3092.9456 3093.7220 3095.2671 3095.6962 3096.7082 3097.2682 3097.4858 3098.1933 3100.8545 3103.7150 3103.9936 3105.2941 3105.3786 3106.5184 3107.4568 3109.8932 3177.2742 3179.1826 3192.8140 3193.0934 3202.1801 3211.8547 3277.3901 3295.7252
redmass: 6.2303 6.5192 6.9735 5.1144 4.8273 4.3764 4.7226 5.5437 5.3197 6.2785 3.1157 4.7321 4.5807 3.2015 3.3131 3.9198 3.9816 3.9945 3.0509 3.3961 3.1095 6.1337 4.1511 2.8434 6.8555 3.2529 4.7101 3.5213 4.6287 4.6276 3.4288 3.1417 3.4336 3.1436 1.2347 3.4014 1.1731 1.3482 1.3194 2.2152 1.5680 1.4031 2.0267 2.2297 1.4114 1.5662 1.6064 4.6083 2.0983 1.7904 2.8439 3.0398 4.5352 5.3769 3.2170 3.0870 5.6171 2.5309 3.3513 3.1022 4.8578 3.2185 4.2381 3.0189 3.1309 2.5548 3.1174 3.7729 4.3601 3.5269 4.5722 3.9335 5.1133 3.2216 3.0208 3.0317 2.8798 2.9174 3.9204 3.7891 3.4097 4.5019 3.9662 5.4476 1.1227 1.6134 3.5338 3.2089 3.2101 1.8116 1.6032 2.6127 3.5134 3.6448 1.5195 1.3757 1.4089 2.5876 2.6092 1.7348 1.6588 1.4013 1.4236 4.3950 2.0853 2.3943 1.3399 1.2927 1.3723 1.6193 1.6152 1.9103 2.1748 4.4107 1.9016 1.4656 1.5152 1.8042 1.3191 1.4470 3.1142 3.5529 1.9206 2.4987 1.9558 1.9812 2.7364 1.5017 1.5092 1.6765 2.4706 2.3381 2.3526 2.3428 2.3402 2.2820 1.5757 1.6396 1.7285 2.0385 2.0471 1.8078 1.8001 1.8631 1.2783 1.3061 1.3258 2.5641 2.9869 3.2233 1.1323 2.1209 2.1972 1.2569 4.2066 3.4430 1.3605 2.9343 1.1777 2.0262 1.4035 1.1085 1.4221 1.4575 1.3283 1.2583 1.9891 2.3784 1.4361 1.4111 1.3613 1.3134 1.4441 1.3727 1.3570 1.4216 1.2524 1.2134 1.1695 1.2175 1.2181 1.2148 1.2145 3.2116 1.0870 1.0833 1.0460 1.0435 1.1485 1.0523 1.0614 1.0830 1.0685 1.3035 1.1241 1.2277 1.3737 1.3064 1.4455 1.3491 1.0730 1.1290 1.0945 1.0511 1.1937 1.1599 1.1680 1.4569 1.4390 6.6280 4.8819 6.5851 4.9776 5.1465 6.5927 12.6149 1.0707 1.0467 1.0348 1.0349 1.0346 1.0352 1.0354 1.0355 1.0372 1.0773 1.0366 1.0650 1.0549 1.0591 1.0549 1.0849 1.0847 1.0853 1.0870 1.1035 1.1013 1.1023 1.1050 1.1024 1.1025 1.1025 1.1020 1.1019 1.1024 1.1025 1.1025 1.1025 1.1022 1.1123 1.1000 1.0998 1.0990 1.1041 1.1099 1.1123 1.0873 1.0868 1.0932 1.0905 1.0960 1.0929 1.0924 1.1106
irintensity: 511.7209 3.7383 0.8757 1.0425 2.0673 1.0902 2.3361 0.9571 2.5864 1.2335 0.5107 4.2957 0.6265 0.1515 0.3898 0.7614 10.0665 1.1702 0.8033 0.6641 3.6600 3.2962 0.1858 0.4192 2.9804 0.1416 8.7451 0.6523 2.7774 2.6273 0.4432 4.8766 3.0716 2.7862 0.8437 4.9203 1.1014 1.5762 0.6900 1.8200 0.7441 1.2329 5.5861 28.2637 7.2354 3.3726 0.6213 18.6607 14.0641 3.1724 0.3127 1.0851 5.2959 18.3395 1.3870 0.8914 2.5010 79.6510 1.9777 99.3662 6.3239 2.5726 14.7312 0.5792 7.6297 0.1185 6.5296 0.1251 4.6696 30.3562 0.6360 2.0538 53.3352 0.2974 0.1304 0.0634 195.1330 0.4253 4.2285 2.3411 5.0960 0.0310 14.9905 0.4769 7.9474 39.3671 6.7693 21.5367 23.6847 14.9596 63.3363 45.8501 6.9329 2.4805 13.4561 0.0822 4.4494 0.6332 0.4397 18.3008 10.6911 1.2090 3.0032 3.4094 13.9902 8.6629 2.7057 0.4098 4.5463 4.3346 6.6811 4.6353 11.2691 307.1961 7.9277 7.8108 2.6583 70.2889 0.0987 0.4430 0.1972 13.0510 23.1561 3.8121 5.9615 1.2321 4.7073 1.0718 25.6976 4.7481 5.7556 3.7676 6.2293 0.8606 5.9072 4.9616 0.6602 10.6328 1.9179 1.4130 0.7015 0.2358 3.2800 2.7169 6.2156 7.7605 0.4428 23.1346 1.4399 2.7534 10.9562 4.1433 5.1027 0.7805 14.5580 0.1798 0.5289 13.1964 0.7914 1.2916 5.7721 2.7337 0.9155 0.4300 0.6960 14.1547 31.8629 25.8464 1.2195 8.7570 5.9495 0.5356 4.9298 3.8589 0.5268 4.3275 7.0717 15.5131 21.4685 3.5807 3.1827 7.8234 5.8824 82.7835 12.3030 6.3973 1.5290 0.8691 43.7995 1.5975 2.8552 1.1203 1.9354 6.4768 2.5071 4.8021 6.5367 0.9723 1.5735 16.9204 23.7832 10.0849 5.8458 14.7859 24.8610 11.5659 5.6271 6.7571 7.2643 358.9033 3.4690 4.5914 2.5379 2.4307 7.4457 42.0584 53.1038 26.1862 16.3207 17.5708 38.4055 37.3695 18.3846 60.7333 7.2959 5.2551 29.3735 15.9626 23.9245 25.2996 34.4839 2.5466 3.4757 1.9353 0.4532 5.9228 26.9851 20.9610 17.1863 10.7760 7.5671 6.6346 51.3231 9.2130 47.6375 33.5781 15.0925 69.2775 40.6857 14.0779 69.4996 125.1598 21.1438 30.7310 17.4896 69.4983 3.1753 1.6809 11.5421 11.8380 15.3597 3.0811 12.2426 5.4486
temp: 298.150 k
press: 1.00000 atm
elementType: 29 7 7 6 1 6 6 1 6 1 6 6 6 1 1 1 6 1 6 1 6 1 6 6 1 6 1 1 1 6 1 1 1 6 6 6 1 6 1 6 1 6 6 1 6 1 1 1 6 1 1 1 6 1 6 1 1 1 6 1 1 1 6 1 1 1 6 1 8 1 6 1 1 6 1 1 6 6 6 6 9 9 1 1 1 1 1 1 6 7
symmnumber: 1
zpe: 2005334.5 jmol-1
zpe.correction: 0.763792 hartree
zpe.thermalcorrener: 0.810195 hartree
zpe.thermalcorrenthalpy: 0.811139 hartree
zpe.thermalcorrgfe: 0.681496 hartree
zpe.sumelectzpe: -3442.331660 hartree
zpe.sumelectthermal: -3442.285257 hartree
zpe.sumelectthermalent: -3442.284313 hartree
zpe.sumelectthermalfe: -3442.413955 hartree
dipole: 9.4363 10.8239 7.7447
dipole: 16.3150
quadrupole: -228.6081 -316.4043 -204.4919
quadrupole: 8.0949 62.7243 -1.8457
quadrupole: 21.2267 -66.5695 45.3428 8.0949 62.7243 -1.8457
hfenergy: -3443.095452 hartree
pointgroup: C01 [X(C35H48Cu1F2N3O1)]
dipole: 3.712522 4.258445 3.0469938 debye
polarizability: 510.1830618|-37.0421101|555.8702816|-29.9691536|10.7448351|503.9577829 unknown
InChI: InChI=1/C27H36N2.C5H8N.C3H4F2O.Cu/c1-18(2)22-11-9-12-23(19(3)4)26(22)28-15-16-29(17-28)27-24(20(5)6)13-10-14-25(27)21(7)8;1-2-3-4-5-6;4-1-3(6)2-5;/h9-16,18-21H,1-8H3;1-4H2;1-2H2;/rC32H44CuN3.C3H4F2O/c1-22(2)26-14-12-15-27(23(3)4)30(26)35-20-21-36(32(35)33-18-10-9-11-19-34)31-28(24(5)6)16-13-17-29(31)25(7)8;4-1-3(6)2-5/h12-17,20-25H,9-11,18H2,1-8H3;1-2H2
charge 0 multiplicity 1
90 atoms
Cu 2.22431864 -1.05009006 4.32654723
N  3.48523572 0.84943193 6.1940875
N  4.57367767 -0.99303234 6.13735464
C  3.35055935 -3.2235275 7.53821748
H  3.28724359 -2.16046411 7.77337808
C  3.4839588 -0.37863846 5.61778374
C  4.56112002 1.00184926 7.05618345
H  4.73006797 1.9109898 7.60526951
C  5.24662253 -0.16476246 7.02310023
H  6.13782665 -0.48055958 7.53554359
C  4.97739247 -2.3291897 5.77597755
C  4.40566535 -3.41007823 6.45933622
C  3.70740444 -3.9552712 8.8387536
H  2.96643052 -3.73404599 9.61081417
H  4.68702832 -3.64899672 9.21293197
H  3.72450027 -5.03862076 8.70264283
C  4.79647609 -4.69103205 6.06813109
H  4.36781761 -5.55381792 6.56104633
C  5.70611032 -4.8764483 5.03769339
H  5.985303 -5.88004656 4.74083
C  6.24207031 -3.78509145 4.36807809
H  6.92878934 -3.94930754 3.54807892
C  5.88628921 -2.48362319 4.71981159
C  6.40224042 -1.29573535 3.92146659
H  6.18642604 -0.38654431 4.4843216
C  5.65003936 -1.194749 2.58477928
H  5.83494668 -2.07469316 1.96469404
H  5.97053581 -0.31105529 2.02750449
H  4.5717944 -1.12755596 2.74419012
C  7.9192631 -1.33814695 3.70185232
H  8.21754732 -2.18095989 3.07495756
H  8.45662069 -1.41856954 4.64950321
H  8.25152781 -0.42609449 3.20008924
C  2.4833286 1.84782235 5.92058419
C  2.62522785 2.64217148 4.77573364
C  1.61928646 3.57586057 4.51595466
H  1.694008 4.20822367 3.64036061
C  0.52503659 3.69891713 5.35862104
H  -0.251731 4.42053236 5.13743117
C  0.40560428 2.8878279 6.48000554
H  -0.47325773 2.97813073 7.10259331
C  1.38200961 1.94161017 6.78636565
C  1.20633012 0.9877795 7.95857936
H  2.18756277 0.59015147 8.22172634
C  0.64494281 1.66672454 9.21301902
H  1.23998402 2.53650922 9.50007763
H  0.65054436 0.96334842 10.04880653
H  -0.38700357 1.99450725 9.07403815
C  0.32485476 -0.20118482 7.53929919
H  -0.68239171 0.13574938 7.28406815
H  0.24530446 -0.92449805 8.35415869
H  0.74006345 -0.71654946 6.67128628
C  3.7926657 2.49137909 3.81259071
H  4.48894699 1.76247241 4.22803725
C  4.56269804 3.80683395 3.63510228
H  3.94277769 4.57868657 3.1735775
H  5.43183372 3.65189289 2.99136733
H  4.91637502 4.19145122 4.59433767
C  3.30958729 1.94171124 2.46195447
H  2.79803793 0.9845301 2.589087
H  4.15161595 1.78375706 1.78494501
H  2.6141485 2.63193089 1.97877177
C  1.97369035 -3.66151735 7.01518651
H  1.70912932 -3.12600899 6.10091827
H  1.19883017 -3.46976937 7.76104376
H  1.96202136 -4.72734115 6.77804587
C  0.76386412 -1.6013241 2.86565168
H  0.58884844 -2.10929292 3.81920765
O  1.55059588 -4.12621743 2.52410008
H  1.78029603 -1.58404959 2.4612574
C  -0.14262516 -0.4247529 2.54419291
H  0.39856611 0.31468119 1.94573992
H  -0.97807566 -0.75906296 1.91404138
C  -0.73352664 0.25938041 3.78172315
H  -1.21763711 -0.49069939 4.41246357
H  0.06378122 0.70846618 4.37942211
C  -1.75857098 1.3462124 3.41110146
C  0.61844181 -3.43763036 2.03100821
C  -0.81362892 -3.73168125 2.48177023
C  0.73969198 -2.97674846 0.57776138
F  -1.29686771 -4.91623472 1.87488587
F  0.50963901 -4.05378029 -0.31286632
H  1.75946437 -2.63332559 0.39615473
H  -0.81932161 -3.90722743 3.55889369
H  0.01834602 -2.20030838 0.31419189
H  -1.51913123 -2.94148271 2.21605433
H  -1.27554132 2.14774548 2.84567984
H  -2.54226788 0.92842135 2.77288384
C  -2.39532216 1.93430717 4.58194934
N  -2.87718284 2.38073307 5.52786666
