program: Gaussian 16
title: Title Card Required
version: ES64L-G16RevB.01
method: RB3LYP
basis: TZVP
operation: Freq
keyword: #P
keyword: Geom=AllCheck
keyword: Guess=TCheck
keyword: SCRF=Check
keyword: GenChk
keyword: RB3LYP/TZVP
keyword: Freq
converged: YES YES NO YES
title: Mulliken charges:
elementType: Cu N N C H C C H C H C C C H H H C H C H C H C C H C H H H C H H H C C C H C H C H C C H C H H H C H H H C H C H H H C H H H C H H H F B C C C H C C C H C H H H C C H H H H H H H H H H H C H H C H H C H H O C H H H
charge: -0.061282 0.007572 0.037709 -0.173376 0.167862 0.079532 -0.041125 0.141765 -0.039884 0.141365 -0.289408 0.253441 -0.386613 0.132563 0.119214 0.126231 -0.270952 0.126054 0.033201 0.117843 -0.292041 0.128934 0.248142 -0.168384 0.162539 -0.385398 0.136987 0.134698 0.106272 -0.381057 0.123866 0.126636 0.132820 -0.186658 0.192182 -0.255708 0.129973 0.003884 0.124635 -0.250223 0.128114 0.174416 -0.161391 0.160671 -0.382298 0.122678 0.132737 0.123455 -0.409264 0.131365 0.133783 0.154727 -0.169088 0.158636 -0.382161 0.125607 0.132649 0.125517 -0.382202 0.109523 0.131964 0.134725 -0.421074 0.163193 0.131294 0.128366 -0.316270 0.200548 -0.170753 -0.075282 -0.302705 0.195059 -0.263571 -0.243530 -0.276782 0.148578 -0.269265 0.146683 0.127669 0.111107 -0.238117 -0.237737 0.113706 0.107804 0.121747 0.126111 0.127972 0.108496 0.123648 0.118529 0.124419 0.118852 0.060863 -0.357781 0.128512 0.131296 -0.169184 0.109660 0.096767 -0.131626 0.093535 0.098567 -0.276495 -0.190234 0.130597 0.103479 0.095373
chargesum: -0.00000
title: Mulliken charges with hydrogens summed into heavy atoms:
elementType: Cu N N C C C C C C C C C C C C C C C C C C C C C C C C C C C F B C C C C C C C C C C C C O C
charge: -0.061282 0.007572 0.037709 -0.005514 0.079532 0.100640 0.101481 -0.289408 0.253441 -0.008605 -0.144897 0.151044 -0.163107 0.248142 -0.005846 -0.007441 0.002265 -0.186658 0.192182 -0.125735 0.128519 -0.122109 0.174416 -0.000720 -0.003428 0.010610 -0.010452 0.001612 -0.005990 0.001780 -0.316270 0.200548 0.024306 0.073296 -0.095159 -0.024795 -0.022019 -0.028924 -0.032797 0.004060 0.005534 -0.097972 0.037243 0.060476 -0.276495 0.139215
polarizability: 5.82460657e+02 -2.30670785e+01 6.43649899e+02 -1.52502744e+01 -1.74355473e+01 5.53139769e+02
1716.lowfreq: -115.6121 -7.5772 -2.9354 0.0037 0.0042 0.0048 7.1482 13.0937 15.3333
redmass: 5.7232 4.6533 4.8118 3.7844 3.7867 3.7613 2.9537 2.9821 3.6238 3.9478 3.7274 3.2134 4.0491 2.9043 3.0183 3.0203 3.6194 3.8502 3.3080 3.9696 4.6194 4.2130 4.5907 4.6270 2.4470 2.4835 3.1339 2.8941 3.4271 2.7959 3.5520 3.3083 3.8150 4.7531 3.1645 3.3822 2.8476 1.1289 1.2773 1.6469 1.1668 1.4998 1.2028 2.0990 1.4723 2.0166 1.7586 3.2685 1.5839 2.0739 1.8659 1.3550 1.6381 3.0932 2.4508 2.9902 3.5623 3.1693 3.0475 4.2494 2.5051 1.7497 3.7751 3.8293 4.6278 3.4919 4.2407 2.9865 2.2267 3.2166 2.6689 2.7573 3.5415 3.8216 1.6520 4.8919 4.3558 3.9261 2.8987 4.2120 3.1160 3.1303 2.9112 2.5501 2.9482 3.7273 4.2066 3.3126 2.2019 4.5144 3.5949 1.5987 5.2075 1.5290 3.5990 4.0492 1.4061 3.6892 2.4514 2.3083 1.5828 1.7380 2.9313 3.7185 3.7440 1.4046 1.3754 1.2434 1.9104 2.6063 2.6047 2.5927 1.5896 1.3950 1.4163 5.1336 2.4649 1.2880 1.2462 1.3965 1.5064 1.7072 1.6433 2.4069 1.6962 1.4693 1.9680 1.4611 1.2946 1.2978 4.4900 1.7785 1.9342 1.7392 1.9131 2.6237 2.7760 2.9081 1.9935 2.0341 2.7217 2.2359 1.4980 1.5287 2.1525 4.0334 2.2482 1.7257 2.4359 2.3491 2.2790 2.2881 2.2931 2.3390 1.4636 1.7673 1.4277 1.6144 1.6979 1.0420 1.2653 2.0327 2.0389 1.3120 1.7721 1.7185 1.5377 1.3212 1.3047 1.5191 2.6660 1.5837 1.3227 3.0107 1.2899 3.9979 2.1465 2.2147 1.8230 2.0102 1.3535 1.3153 3.4978 3.4209 1.3499 1.0814 1.4477 2.5908 1.5570 1.4033 1.3334 1.1644 1.3110 1.3804 2.4705 1.3737 1.5721 1.3644 1.3308 1.2771 1.3127 1.3835 1.4194 1.4694 1.4525 2.2523 1.2128 1.2315 1.2578 1.2192 1.2189 1.2156 1.3335 1.2299 2.5292 1.3103 1.0939 1.0753 1.1252 1.0628 1.0786 1.1041 1.0453 1.0673 1.1507 1.0597 1.1938 1.0795 1.0959 1.1346 1.4084 1.2604 1.4270 1.4572 1.0980 1.1357 1.1280 1.4325 1.0646 1.0809 1.1090 1.1031 1.0639 1.2925 1.2176 1.2478 1.1268 1.0857 1.0933 4.9024 5.9660 5.6110 5.6404 5.8139 1.0740 1.0511 1.0404 1.1055 1.0691 1.0664 1.0652 1.0677 1.1039 1.0815 1.0579 1.0813 1.0826 1.0349 1.0404 1.0493 1.0365 1.0444 1.0384 1.0394 1.0383 1.0391 1.0754 1.0900 1.0876 1.0855 1.0997 1.0877 1.0854 1.0860 1.1050 1.0871 1.0880 1.0946 1.1018 1.1024 1.1025 1.1025 1.1023 1.1024 1.1024 1.0914 1.0999 1.0995 1.0972 1.0958 1.0993 1.0975 1.1006 1.0992 1.0983 1.0991 1.0792 1.0867 1.0868 1.0906 1.0904 1.0958 1.0958 1.0920 1.1105
irintensity: 95.6180 0.0881 0.0385 0.3863 0.3273 0.1455 1.2425 3.5685 0.2541 1.4516 0.6032 0.2989 0.1521 1.3012 1.2019 0.0821 0.4606 0.0909 0.5564 1.5032 1.7315 2.0940 0.5075 0.5888 2.1002 0.6976 0.2061 2.4204 1.9693 0.7624 3.3134 0.7658 2.0811 5.2385 39.0459 3.2393 0.9670 1.1419 5.2752 0.6422 1.2288 0.1212 0.3285 0.2130 3.1123 3.9609 2.6310 5.3102 1.2759 16.6926 3.4234 1.5336 6.3945 1.6687 0.7272 0.8470 4.1064 1.1232 0.7213 0.1657 2.6726 0.1177 4.4665 26.0648 1.3155 2.8702 2.2393 1.0566 114.2797 33.8765 4.8098 9.9570 37.2772 0.2341 66.7728 0.4731 0.4350 7.0637 30.4034 0.7544 0.1290 0.0654 0.0155 9.9129 0.1736 3.3896 1.6709 5.4675 38.4292 0.1450 17.6981 13.1438 1.9888 42.1855 14.2039 5.0320 2.7840 40.2209 9.8907 1.7159 39.8522 44.7365 1.3187 0.1378 4.7182 0.1717 0.0484 9.2544 20.9704 0.4056 0.8444 40.3173 24.8494 0.5926 2.8604 24.5994 1.1368 1.4256 0.5407 2.7438 2.0527 7.2462 7.1901 10.9749 3.5593 0.3765 6.3934 0.1075 0.3711 0.2848 0.3981 8.8762 17.9258 9.2154 13.0755 14.6387 15.5236 16.6263 2.7571 4.2808 63.4410 41.2510 0.1153 19.8842 65.6683 227.9803 4.5746 3.2189 4.1669 2.8034 1.0668 5.8053 1.5573 6.6243 1.2720 23.9582 21.6635 9.7051 0.5947 0.0602 2.3747 2.7827 1.3587 0.7402 0.3949 3.8846 1.5859 6.1409 7.4474 17.2841 15.2044 79.2517 1.2318 0.7732 21.4668 1.5106 2.8664 6.5442 16.6355 10.9169 1.8494 4.1956 0.3059 8.7686 14.3316 0.0955 12.1708 1.6864 1.4150 3.3648 0.7576 6.6307 0.8505 10.8791 25.8177 2.6114 42.2833 8.4725 3.3081 0.5917 2.8325 1.5842 1.3032 5.5829 10.6493 1.6250 0.9492 5.0223 6.0578 10.7481 2.7518 4.7723 30.0934 1.5477 73.3862 19.7853 7.5518 2.7187 0.5575 1.0067 2.5818 23.9358 6.9120 2.1040 24.2398 0.2828 4.8727 2.7965 3.2951 0.9763 10.4963 12.4956 1.1992 4.3388 9.6066 1.0914 26.1784 23.5626 17.8266 7.2046 1.2011 4.6468 10.5940 25.5252 14.8403 14.7466 11.9025 10.3094 4.5279 2.6038 1.4621 7.7795 1.1795 8.9282 32.0344 38.2126 97.2986 70.7672 61.5946 31.6748 54.5319 61.7919 74.1922 111.3337 9.3738 96.6205 166.8886 27.1834 5.7396 51.8127 46.1715 1.1407 19.7851 60.0906 6.8748 47.0175 92.5496 15.6068 5.7178 35.2639 1.1644 8.5849 1.6737 1.3456 87.6588 0.5269 8.8123 77.0456 4.5289 4.3830 0.6171 36.3768 6.2815 51.9099 39.7754 89.2352 71.7674 4.3676 132.5407 26.4991 50.4796 78.2752 63.5931 18.2524 8.7766 8.2041 26.0543 2.4028 2.4436 10.0824 10.3067 14.6382 14.5812 9.8193 2.9614
temp: 298.150 k
press: 1.00000 atm
elementType: 29 7 7 6 1 6 6 1 6 1 6 6 6 1 1 1 6 1 6 1 6 1 6 6 1 6 1 1 1 6 1 1 1 6 6 6 1 6 1 6 1 6 6 1 6 1 1 1 6 1 1 1 6 1 6 1 1 1 6 1 1 1 6 1 1 1 9 5 6 6 6 1 6 6 6 1 6 1 1 1 6 6 1 1 1 1 1 1 1 1 1 1 1 6 1 1 6 1 1 6 1 1 8 6 1 1 1
symmnumber: 1
zpe: 2469066.7 jmol-1
zpe.correction: 0.940418 hartree
zpe.thermalcorrener: 0.990569 hartree
zpe.thermalcorrenthalpy: 0.991513 hartree
zpe.thermalcorrgfe: 0.854557 hartree
zpe.sumelectzpe: -3510.922873 hartree
zpe.sumelectthermal: -3510.872722 hartree
zpe.sumelectthermalent: -3510.871778 hartree
zpe.sumelectthermalfe: -3511.008734 hartree
dipole: 7.0031 2.6536 5.9900
dipole: 9.5898
quadrupole: -238.6904 -287.2454 -222.7847
quadrupole: 0.3984 56.4535 17.9536
quadrupole: 10.8831 -37.6719 26.7888 0.3984 56.4535 17.9536
hfenergy: -3511.8632911 hartree
pointgroup: C01 [X(C40H61B1Cu1F1N2O1)]
dipole: 2.7552135 1.0439936 2.3566655 debye
polarizability: 582.4606574|-23.0670785|643.6498986|-15.2502744|-17.4355473|553.1397694 unknown
InChI: InChI=1/C27H36N2.C8H14BF.C5H11O.Cu/c1-18(2)22-11-9-12-23(19(3)4)26(22)28-15-16-29(17-28)27-24(20(5)6)13-10-14-25(27)21(7)8;10-9-7-3-1-4-8(9)6-2-5-7;1-3-4-5-6-2;/h9-16,18-21H,1-8H3;7-8H,1-6H2;1,3-5H2,2H3;/rC32H47CuN2O.C8H14BF/c1-22(2)26-14-12-15-27(23(3)4)30(26)34-19-20-35(32(34)33-18-10-11-21-36-9)31-28(24(5)6)16-13-17-29(31)25(7)8;10-9-7-3-1-4-8(9)6-2-5-7/h12-17,19-20,22-25H,10-11,18,21H2,1-9H3;7-8H,1-6H2
charge 0 multiplicity 1
107 atoms
Cu 3.35284234 -0.32164194 5.69786052
N  4.81668673 1.3556277 7.60138686
N  5.60177888 -0.62736171 7.72904931
C  4.15227041 -2.42465663 9.48369661
H  4.200547 -1.33596647 9.5063259
C  4.66295812 0.10822216 7.07884519
C  5.82429442 1.39495179 8.55305208
H  6.08444759 2.29875481 9.07475541
C  6.32220679 0.13966199 8.63349606
H  7.10610133 -0.27811976 9.23972565
C  5.76250025 -2.04215566 7.52732159
C  5.03719687 -2.91655998 8.34790395
C  4.66286572 -2.93313305 10.8399681
H  4.05706679 -2.5224979 11.65168586
H  5.70192158 -2.6414195 11.01124307
H  4.60773055 -4.02260832 10.90272505
C  5.14369601 -4.28116633 8.07862975
H  4.58562199 -4.98766882 8.67964981
C  5.932383 -4.74308227 7.03487751
H  5.98437232 -5.80546456 6.82900533
C  6.65110035 -3.85234031 6.24911373
H  7.26023679 -4.22937404 5.43776474
C  6.59008069 -2.47877052 6.48429184
C  7.36588996 -1.50349378 5.61153986
H  7.34969417 -0.52959169 6.10233094
C  6.69215182 -1.33660726 4.24242027
H  6.66517333 -2.28449306 3.70069254
H  7.23721012 -0.61141225 3.63321096
H  5.6653852 -0.98456683 4.35114476
C  8.83825998 -1.90668288 5.45703596
H  8.94833213 -2.83644721 4.89474459
H  9.319327 -2.04268587 6.42840144
H  9.38356814 -1.13075622 4.91420427
C  3.97843428 2.46366372 7.22203165
C  4.38017566 3.2732822 6.15064767
C  3.50195995 4.27717345 5.74175193
H  3.76590878 4.90948412 4.90385421
C  2.28659383 4.46788544 6.38470996
H  1.61252055 5.24342525 6.0414176
C  1.92743013 3.66527525 7.45821918
H  0.97334053 3.82122349 7.94514579
C  2.76534316 2.64141493 7.90180798
C  2.33462517 1.73455155 9.04480658
H  3.18078607 1.10050127 9.31125613
C  1.95577759 2.53275747 10.29961258
H  2.76719801 3.19390656 10.61332516
H  1.73504367 1.85136344 11.12494956
H  1.06727899 3.14670615 10.13600815
C  1.19190459 0.80705428 8.60724386
H  0.30512321 1.38073994 8.32734459
H  0.91403632 0.13549146 9.42319194
H  1.47524056 0.1943551 7.75213356
C  5.6972446 3.05301821 5.42162056
H  6.30270567 2.37041608 6.01889743
C  6.4991225 4.35219302 5.26860083
H  5.99741965 5.06394962 4.60955255
H  7.47859549 4.13898504 4.83355216
H  6.65560668 4.84086317 6.23311075
C  5.46307424 2.38275638 4.06004981
H  4.96186989 1.42191913 4.17863389
H  6.41393831 2.21179495 3.54914781
H  4.83967967 3.00831316 3.41657161
C  2.68154532 -2.80375824 9.26499843
H  2.30205706 -2.41230444 8.32187765
H  2.06620728 -2.39762421 10.07186399
H  2.5467921 -3.88785165 9.26201986
F  1.07994433 -1.77197778 6.39931994
B  1.6383524 -2.13288437 5.17074055
C  2.87325908 -3.14019678 5.19408773
C  0.579363 -2.59383659 4.07502017
C  2.03646067 0.12389317 4.25991231
H  3.66906087 -2.87161707 5.8942867
C  2.27237711 -4.47402943 5.73597176
C  3.49979387 -3.24336431 3.79028511
C  -0.03599941 -3.87583709 4.70978223
H  -0.23642533 -1.87104473 3.95943944
C  1.19440949 -2.85184373 2.68205443
H  1.71331671 -0.43753446 3.3901261
H  2.04828441 -4.31808918 6.79454677
H  3.03684707 -5.2592915 5.69922922
C  0.99226615 -4.97682054 5.03534853
C  2.52358493 -3.63467214 2.6692611
H  4.33626819 -3.95227484 3.80183131
H  3.92937504 -2.2651227 3.55252846
H  -0.80407498 -4.28905816 4.04499967
H  -0.54931184 -3.58363701 5.63120347
H  1.36410857 -1.88605157 2.19848754
H  0.46825288 -3.37430875 2.04686068
H  0.51636617 -5.72873887 5.67413805
H  1.25735501 -5.50186761 4.11771053
H  3.01385622 -3.47974138 1.70212712
H  2.32468196 -4.70528776 2.72414459
H  2.78971441 0.81698881 3.84377274
C  0.8780042 0.95652816 4.81861425
H  0.09287757 0.28993043 5.18796396
H  1.21561661 1.52192666 5.69167591
C  0.28030572 1.94626782 3.81218771
H  -0.08165636 1.41081123 2.9287427
H  1.05931148 2.63581449 3.47170593
C  -0.85669755 2.7550995 4.40534065
H  -0.51566381 3.27504813 5.31389836
H  -1.68433818 2.09184512 4.7001647
O  -1.31727176 3.70864222 3.45065555
C  -2.39108454 4.48859938 3.93567014
H  -2.67477938 5.18605679 3.14620096
H  -3.26454927 3.87073755 4.18890527
H  -2.10769857 5.06540198 4.82841472
