program: Gaussian 09
title: Title Card Required
version: ES64L-G09RevD.01
method: RB3LYP
basis: TZVP
operation: Freq
keyword: #P
keyword: Geom=AllCheck
keyword: Guess=TCheck
keyword: SCRF=Check
keyword: GenChk
keyword: RB3LYP/TZVP
keyword: Freq
converged: YES YES YES YES
title: Mulliken charges:
elementType: Cu N N C H C C H C H C C C H H H C H C H C H C C H C H H H C H H H C C C H C H C H C C H C H H H C H H H C H C H H H C H H H C H H H C H O H C H H C H H C C C C F F F F H H O C H H H H H
charge: -0.039856 0.026033 0.027795 -0.175035 0.164699 0.098224 -0.034231 0.146397 -0.037557 0.146623 -0.230443 0.213881 -0.386504 0.133192 0.124228 0.129184 -0.254123 0.131747 0.014088 0.122878 -0.266374 0.130042 0.216798 -0.162829 0.157094 -0.378575 0.137294 0.133609 0.117206 -0.385919 0.128636 0.127012 0.133587 -0.237347 0.223522 -0.297606 0.128115 0.040225 0.119642 -0.220788 0.128950 0.184283 -0.164486 0.155874 -0.381198 0.126828 0.135085 0.127159 -0.384342 0.143680 0.135382 0.120769 -0.182211 0.171967 -0.386539 0.127523 0.134060 0.126051 -0.389667 0.121762 0.140104 0.136704 -0.379883 0.124114 0.133421 0.141164 -0.435676 0.067822 -0.365309 0.073958 -0.037030 0.117444 0.145215 -0.270841 0.124019 0.137106 -0.114862 0.122204 0.232908 0.239612 -0.209851 -0.214186 -0.215132 -0.206367 0.094811 0.114834 -0.284764 -0.200260 0.129651 0.098457 0.112721 0.116297 0.116108
chargesum: 0.00000
title: Mulliken charges with hydrogens summed into heavy atoms:
elementType: Cu N N C C C C C C C C C C C C C C C C C C C C C C C C C C C C O C C C C C C F F F F O C
charge: -0.039856 0.026033 0.027795 -0.010336 0.098224 0.112166 0.109066 -0.230443 0.213881 0.000100 -0.122376 0.136967 -0.136332 0.216798 -0.005735 0.009533 0.003317 -0.237347 0.223522 -0.169491 0.159866 -0.091838 0.184283 -0.008612 0.007873 0.015489 -0.010244 0.001094 0.008903 0.018815 -0.293897 -0.365309 0.225629 -0.009716 0.094783 0.122204 0.349204 0.355720 -0.209851 -0.214186 -0.215132 -0.206367 -0.284764 0.140569
polarizability: 5.19900863e+02 -2.66873082e+01 5.78113579e+02 -1.75966581e+01 3.09549910e+00 4.97584559e+02
1716.lowfreq: -423.3192 0.0039 0.0056 0.0061 2.1044 7.2422 8.2211 17.1706 20.1810
redmass: 3.2120 5.5175 5.1822 6.1148 5.5156 4.8068 4.9885 4.1972 5.6498 7.5114 4.7463 4.5208 3.9767 4.3022 4.4542 3.8703 3.9243 3.3598 3.1759 2.9102 7.9796 3.0988 2.9168 3.2981 6.2137 3.3943 4.4856 4.1802 3.5391 4.6681 2.6705 2.8346 5.1123 3.4102 6.4009 3.3990 2.3312 1.6843 1.5985 1.5544 1.2026 1.1639 2.2967 1.4762 1.3657 2.0765 1.8238 1.7303 5.0345 1.3637 1.5233 1.9149 8.5270 1.7483 1.9506 2.9855 4.0090 3.2653 3.1467 4.6481 5.2657 5.0827 4.8360 4.5709 3.1719 2.9721 3.2978 2.5609 2.9658 5.6280 3.7573 6.0457 3.6582 4.8966 4.3944 3.9704 13.4459 3.0861 3.4537 2.9351 2.8688 5.6743 2.8951 4.1538 3.8795 3.2465 4.4941 3.6901 5.4181 1.5167 3.6290 3.8432 3.2768 1.2364 1.7846 1.5987 1.7787 3.7387 3.7757 1.2172 1.3788 2.7779 1.4410 2.5974 2.6040 1.4014 1.4563 2.0391 1.5790 1.2339 1.8564 1.2857 1.3820 1.4939 2.0435 1.9492 1.5109 2.8516 1.5524 1.4468 7.5777 1.3021 1.3067 4.1828 8.9060 3.7450 8.4712 1.9452 1.9823 2.3690 1.4896 1.4962 3.0563 1.6711 3.1069 3.6644 3.6916 2.3225 2.3567 2.3283 2.3687 2.2951 1.6224 1.7019 1.7194 1.3104 2.0336 2.0384 1.7567 1.8022 1.3076 1.2738 1.5432 2.5343 1.2283 5.6721 2.9286 3.3367 2.1310 2.2036 4.1956 3.4769 3.3030 1.2911 1.1500 1.5470 1.0716 1.7229 1.5703 1.3785 1.2687 1.4978 1.4945 1.7455 1.6126 1.1759 1.3216 1.3290 1.4294 1.4293 2.3520 1.2204 1.2097 1.2522 1.2396 1.2408 1.2152 1.2141 1.2183 1.2162 1.6021 2.3427 1.0821 1.0459 1.1099 1.0551 1.0506 1.1427 1.0574 1.0564 1.3062 1.2136 1.5474 1.1064 1.1084 1.3791 1.3080 1.2661 1.1224 1.1556 1.0699 1.0940 1.1120 1.1838 1.4858 1.1978 1.2961 1.0928 8.2817 4.8890 5.4620 5.6211 5.7380 6.2321 1.0525 1.0417 1.1030 1.1035 1.0616 1.0480 1.0407 1.0356 1.0379 1.0374 1.0354 1.0355 1.0358 1.0354 1.0926 1.0854 1.0851 1.0854 1.0858 1.1012 1.0509 1.1025 1.1023 1.1024 1.0877 1.1024 1.1019 1.1025 1.0934 1.0990 1.1014 1.1022 1.1023 1.1018 1.1018 1.0961 1.0997 1.0998 1.0990 1.0995 1.0870 1.0868 1.0915 1.0904 1.1189 1.0957 1.0947 1.0923 1.1106
irintensity: 1222.7011 0.5325 0.2567 0.8258 0.4615 0.1411 0.2475 1.1345 0.5307 0.9568 0.2345 0.4916 0.1852 0.8458 1.7643 1.1859 0.0928 1.7669 0.2879 0.9216 5.6641 1.5010 0.3214 2.3777 2.1854 0.0281 0.7593 0.2489 0.6295 2.3526 1.3203 2.4799 8.6882 3.8385 5.9981 9.7214 0.6211 21.0895 17.0154 3.7633 1.8534 1.3971 21.7239 6.9738 0.4150 1.1259 2.2138 0.5891 6.5831 0.8656 0.3513 1.3008 4.3045 2.2739 0.1579 0.4223 4.8242 1.2226 0.2074 3.2577 0.9335 12.0364 3.0464 23.0739 2.6239 0.1601 8.4786 0.0632 4.9287 75.5686 0.2061 42.9067 4.9685 0.6072 0.0136 1.9638 0.3688 101.6385 18.0999 0.5416 0.1583 21.9203 0.4834 0.8586 3.9856 6.0205 0.0401 16.5247 0.8034 42.2287 10.2420 13.2057 23.2104 3.8717 17.9250 46.3433 33.3334 0.5380 2.8052 13.9581 0.0187 63.4992 9.0265 0.6054 0.3068 1.1853 6.5634 6.0349 2.5801 1.1993 4.1358 2.9569 2.1508 9.9620 21.4024 5.7601 0.7331 10.7943 1.0887 0.4720 13.4557 0.6526 0.1917 0.6310 507.4524 40.2212 14.0508 5.1601 1.1896 18.0978 0.9506 25.1542 69.8454 4.7421 102.2549 220.2824 65.6769 3.6718 4.3970 1.7442 6.0984 8.2155 12.5208 19.8467 1.6078 3.7578 1.4036 0.7406 0.1794 3.5388 7.2101 4.1608 21.1629 20.4191 10.4221 6.3270 2.0794 3.3624 4.0135 5.6969 16.5320 0.7606 9.0251 7.6284 1.3987 2.9442 0.5942 2.7780 0.5553 4.3488 20.9372 1.3519 10.6466 20.4643 33.4497 20.8031 51.9534 17.8321 0.5854 10.4978 2.9971 0.0233 0.8538 5.8122 3.8792 14.5659 5.6744 3.4555 7.1326 5.3994 0.4080 114.0559 4.7460 1.8378 4.0124 7.6548 3.9452 31.3822 4.0213 2.0963 2.2278 6.2148 11.2783 1.7121 4.7910 2.2610 4.8168 23.1365 9.5640 17.4006 10.8859 24.9499 8.6275 15.5928 2.1141 8.1145 9.2825 7.2431 407.9108 2.7489 1.8134 1.7021 3.5560 10.9263 29.7777 99.0770 76.5100 78.2281 16.0735 25.2628 7.0719 18.3766 78.4231 10.1079 10.2506 50.8993 47.7547 37.4949 11.5095 0.9509 4.4485 1.9338 1.0596 61.9338 26.4997 2.9059 17.8805 11.1859 25.0529 7.8102 10.6571 14.6751 18.1954 23.6443 14.3524 7.2566 97.6216 80.6683 24.8891 35.8196 70.8127 105.7850 57.0511 39.1282 2.5464 2.1272 10.4718 13.4531 1.2472 15.3240 13.3992 11.6054 4.4843
temp: 298.150 k
press: 1.00000 atm
elementType: 29 7 7 6 1 6 6 1 6 1 6 6 6 1 1 1 6 1 6 1 6 1 6 6 1 6 1 1 1 6 1 1 1 6 6 6 1 6 1 6 1 6 6 1 6 1 1 1 6 1 1 1 6 1 6 1 1 1 6 1 1 1 6 1 1 1 6 1 8 1 6 1 1 6 1 1 6 6 6 6 9 9 9 9 1 1 8 6 1 1 1 1 1
symmnumber: 1
zpe: 2052215.7 jmol-1
zpe.correction: 0.781648 hartree
zpe.thermalcorrener: 0.830361 hartree
zpe.thermalcorrenthalpy: 0.831305 hartree
zpe.thermalcorrgfe: 0.696549 hartree
zpe.sumelectzpe: -3663.173704 hartree
zpe.sumelectthermal: -3663.124991 hartree
zpe.sumelectthermalent: -3663.124047 hartree
zpe.sumelectthermalfe: -3663.258803 hartree
dipole: 9.5038 9.9283 9.2826
dipole: 16.5849
quadrupole: -230.4102 -300.6875 -199.7039
quadrupole: -11.9546 45.4656 10.6620
quadrupole: 13.1903 -57.0869 43.8966 -11.9546 45.4656 10.6620
hfenergy: -3663.9553521 hartree
pointgroup: C01 [X(C35H49Cu1F4N2O2)]
dipole: 3.7390888 3.9060777 3.6520598 debye
polarizability: 519.9008631|-26.6873082|578.113579|-17.5966581|3.0954991|497.5845593 unknown
InChI: InChI=1/C27H36N2.C5H11O.C3H2F4O.Cu/c1-18(2)22-11-9-12-23(19(3)4)26(22)28-15-16-29(17-28)27-24(20(5)6)13-10-14-25(27)21(7)8;1-3-4-5-6-2;4-2(5)1(8)3(6)7;/h9-16,18-21H,1-8H3;1,3-5H2,2H3;2-3H;/rC32H47CuN2O.C3H2F4O/c1-22(2)26-14-12-15-27(23(3)4)30(26)34-19-20-35(32(34)33-18-10-11-21-36-9)31-28(24(5)6)16-13-17-29(31)25(7)8;4-2(5)1(8)3(6)7/h12-17,19-20,22-25H,10-11,18,21H2,1-9H3;2-3H
charge 0 multiplicity 1
93 atoms
Cu 2.23878582 -1.02807427 4.32424432
N  3.48244935 0.82613347 6.24697463
N  4.59396007 -0.99920716 6.14774216
C  3.43782992 -3.26729311 7.53139573
H  3.38479587 -2.21219003 7.80268603
C  3.49908146 -0.38512901 5.63593411
C  4.54768283 0.96740345 7.12358117
H  4.7009575 1.86329796 7.69840242
C  5.24953441 -0.18839748 7.06268417
H  6.14024219 -0.50748602 7.57398955
C  5.01589773 -2.32001009 5.75640863
C  4.47810397 -3.4221663 6.43355887
C  3.80416449 -4.04438095 8.80231341
H  3.07467069 -3.84203141 9.59026837
H  4.79076618 -3.75848024 9.17432672
H  3.80970116 -5.12299912 8.6320195
C  4.88553994 -4.68975795 6.01667003
H  4.48284955 -5.56760972 6.504858
C  5.78162562 -4.84235139 4.96849716
H  6.07829389 -5.83591511 4.65480788
C  6.28446502 -3.73091263 4.30603635
H  6.96368679 -3.86928431 3.47488018
C  5.90826398 -2.44150428 4.68220406
C  6.38867497 -1.23327574 3.89227788
H  6.14198927 -0.3350434 4.4597873
C  5.6376879 -1.1477942 2.5537457
H  5.85318871 -2.0177694 1.92885142
H  5.93225182 -0.25210516 2.00180035
H  4.55743697 -1.11108974 2.71094069
C  7.90712591 -1.22806924 3.6777584
H  8.23304429 -2.05827841 3.04758069
H  8.44338473 -1.297455 4.6269013
H  8.21346245 -0.3036459 3.1821978
C  2.47974642 1.82553376 5.97991617
C  2.67052379 2.68710306 4.89203031
C  1.66505583 3.61971453 4.62982611
H  1.77161746 4.29638638 3.79158284
C  0.522976 3.67678774 5.41404698
H  -0.25594057 4.39241885 5.18368199
C  0.35696257 2.80121901 6.47762406
H  -0.55797051 2.83508465 7.05331068
C  1.33043205 1.85194342 6.78385189
C  1.09472345 0.8288619 7.88454726
H  2.04589521 0.34510731 8.11083657
C  0.58737231 1.46033401 9.18673922
H  1.24994473 2.2582244 9.5297507
H  0.53453234 0.70379463 9.97320994
H  -0.41396388 1.88064347 9.07265937
C  0.13110694 -0.2611664 7.38743924
H  -0.84246681 0.16514006 7.13557152
H  -0.01831986 -1.02283934 8.15638417
H  0.51878871 -0.75360499 6.49367306
C  3.8836848 2.59016805 3.97974493
H  4.58901262 1.88513671 4.42125826
C  4.61268146 3.93246945 3.83827542
H  3.9881719 4.68378023 3.35003005
H  5.51395521 3.8101271 3.23274912
H  4.9112708 4.32707401 4.81213599
C  3.47683944 2.03006687 2.60827694
H  3.00149177 1.05207822 2.70971685
H  4.35107149 1.91563047 1.96365965
H  2.77064665 2.69465873 2.10537127
C  2.0523913 -3.67730816 7.00791174
H  1.78177114 -3.1072226 6.11670174
H  1.28730431 -3.50678618 7.76897618
H  2.0312754 -4.73449257 6.73472361
C  0.84614813 -1.55353277 2.87554314
H  0.47615529 -2.06039235 3.76276859
O  1.03602649 -4.3302317 2.81762843
H  1.76770743 -1.88090937 2.40402838
C  0.13735952 -0.30621822 2.38545111
H  0.86300947 0.38778318 1.94897503
H  -0.55946885 -0.55608628 1.58105342
C  -0.63615126 0.40870584 3.4974121
H  -1.34233068 -0.28941969 3.95705409
H  0.05030325 0.73230578 4.28550456
C  -1.40239734 1.61554962 2.99536414
C  0.31209687 -3.56312823 2.15744879
C  -1.17616269 -3.54680237 2.52972786
C  0.69112838 -3.38248452 0.68121966
F  -1.89616326 -2.51803351 1.97738095
F  -1.77126976 -4.70939679 2.07775454
F  0.30806117 -4.50500803 -0.02830229
F  0.09372976 -2.31995268 0.05168746
H  -0.70670715 2.35504023 2.56961794
H  -2.10044915 1.32275128 2.19725064
O  -2.12101431 2.19549507 4.07919727
C  -2.81939716 3.36543609 3.70765707
H  -3.31298528 3.75182961 4.60048749
H  -2.14481228 4.13946967 3.31387501
H  -3.58464621 3.16097955 2.94568469
H  -1.29456778 -3.51805505 3.61407486
H  1.77387548 -3.28604121 0.58440028
