program: Gaussian 16
title: Title
version: ES64L-G16RevB.01
method: RB3LYP
basis: TZVP
operation: Freq
keyword: #P
keyword: Geom=AllCheck
keyword: Guess=TCheck
keyword: SCRF=Check
keyword: GenChk
keyword: RB3LYP/TZVP
keyword: Freq
converged: YES YES NO YES
title: Mulliken charges:
elementType: Cu N N C H C C H C H C C C H H H C H C H C H C C H C H H H C H H H C C C H C H C H C C H C H H H C H H H C H C H H H C H H H C H H H F B C C C C H H H C C C H C H H H H C C H H H H H H H H H H C H H C F F F
charge: 0.078131 0.025520 0.019072 -0.144943 0.145476 0.132790 -0.046872 0.146898 -0.024761 0.150541 -0.206965 0.205192 -0.378010 0.137491 0.130382 0.127076 -0.255715 0.130908 0.003674 0.122987 -0.263778 0.129141 0.218385 -0.187896 0.180367 -0.409084 0.136345 0.141606 0.144328 -0.392611 0.129043 0.123845 0.134622 -0.245474 0.227854 -0.268179 0.131432 0.017446 0.119732 -0.263393 0.132350 0.235393 -0.182694 0.172518 -0.383183 0.123736 0.135130 0.126326 -0.397470 0.140560 0.148694 0.111454 -0.159961 0.152932 -0.380115 0.126318 0.134073 0.127660 -0.400224 0.129669 0.135216 0.138155 -0.367523 0.109078 0.137621 0.131506 -0.451169 0.153944 -0.264964 -0.065342 -0.213864 -0.265239 0.102464 0.117917 0.107244 -0.282624 -0.286291 -0.243273 0.141262 -0.293651 0.134282 0.119645 0.118434 0.099949 -0.213923 -0.248094 0.100486 0.112765 0.102937 0.116440 0.120274 0.107687 0.118924 0.107082 0.123384 0.117683 -0.281256 0.147873 0.148777 0.448689 -0.178764 -0.175282 -0.184230
chargesum: -0.00000
title: Mulliken charges with hydrogens summed into heavy atoms:
elementType: Cu N N C C C C C C C C C C C C C C C C C C C C C C C C C C C F B C C C C C C C C C C C C F F F
charge: 0.078131 0.025520 0.019072 0.000532 0.132790 0.100026 0.125780 -0.206965 0.205192 0.016940 -0.124807 0.126661 -0.134637 0.218385 -0.007529 0.013195 -0.005101 -0.245474 0.227854 -0.136747 0.137178 -0.131043 0.235393 -0.010176 0.002009 0.003237 -0.007029 0.007937 0.002816 0.010681 -0.451169 0.153944 -0.044582 0.041902 -0.072602 -0.011312 -0.064241 -0.073040 -0.023895 -0.065690 0.012083 -0.007027 0.015394 0.448689 -0.178764 -0.175282 -0.184230
polarizability: 5.66171852e+02 -2.40401606e+01 5.63068793e+02 -1.91814961e+01 -3.94929436e+01 5.70659995e+02
1716.lowfreq: -5.2033 0.0042 0.0060 0.0061 4.1767 10.6291 19.0651 24.5261 27.2986
redmass: 6.1663 4.2597 5.5723 5.1948 5.4824 7.2015 4.9412 4.8212 4.1922 3.8940 4.0072 4.5569 3.5687 3.3589 3.5039 2.9803 4.4350 4.1200 3.6036 3.4301 4.9193 6.5590 3.9819 3.2941 2.7198 2.5701 3.1268 4.2127 3.5931 2.7369 3.3718 4.5128 4.8083 3.0097 1.1488 1.2466 1.3010 2.2992 1.2667 1.5564 2.2017 1.7148 2.3269 1.6177 1.2463 2.3168 1.7659 2.2843 2.5522 2.3126 2.9643 3.0347 3.3308 2.7680 2.9381 3.3254 1.9275 5.3466 3.5720 3.2222 2.6142 4.7924 2.2206 3.2482 4.2663 2.9985 3.2426 2.6095 2.9248 3.8762 3.8048 5.6873 3.4171 7.1165 4.5189 4.7963 5.0085 4.0023 3.2087 3.6405 3.4388 2.9597 3.2147 2.9596 3.5941 3.6637 4.0727 3.3114 3.3750 4.4729 3.2880 1.4847 5.3424 1.6233 1.4741 4.1224 2.7890 3.1787 2.6950 2.6222 1.8198 1.7933 2.6770 3.7212 3.8108 2.7845 2.6330 1.3797 1.3896 1.9666 2.5849 2.6089 1.9626 2.1521 1.4060 1.4059 2.3591 1.5784 1.5275 1.2323 1.2804 1.5324 1.5500 2.3304 1.7707 1.8258 1.5915 1.9612 1.5765 1.2977 1.2952 2.0978 4.4390 2.0799 2.2595 2.9919 2.7306 2.4728 2.2190 1.9686 1.9788 2.0780 1.5095 1.5151 1.8854 2.7223 2.2885 1.6871 2.4843 2.3281 2.3549 2.3211 2.3111 2.0905 1.7905 1.5123 1.6253 1.7841 1.0602 2.0581 2.0425 1.3829 1.7232 1.7473 1.3244 1.3649 1.6505 1.5999 2.6053 1.7148 2.5861 1.4645 3.0232 3.3847 2.0633 2.1899 1.2023 4.0394 1.5734 3.9214 3.5219 1.2709 1.5874 1.2048 1.5205 1.6606 1.2956 1.5693 1.4087 1.2175 1.4869 1.3801 1.3155 2.2455 2.0214 1.3616 1.2819 1.3449 1.4168 1.4861 1.4088 1.4669 1.4559 1.8794 1.2491 1.2253 1.2768 1.3003 1.2149 1.2159 1.2140 1.2165 3.1414 1.0875 1.1008 1.0452 1.0757 1.0607 1.2493 1.1159 1.0701 1.1218 1.2909 1.0804 1.2335 1.0864 1.3319 1.4545 1.3094 1.1430 1.2583 1.0744 1.1542 1.1643 1.1314 1.0914 1.0971 1.3053 1.1794 1.1231 1.2567 1.0878 4.8963 5.5817 6.0320 5.8587 5.5756 1.0774 1.0736 1.0695 1.0686 1.0697 1.0731 1.0707 1.0947 1.0864 1.0804 1.0912 1.0792 1.0893 1.0730 1.0375 1.0367 1.0361 1.0496 1.0353 1.0463 1.0375 1.0352 1.0376 1.0603 1.0933 1.0843 1.0847 1.0850 1.1005 1.0882 1.0879 1.1022 1.1022 1.1025 1.1026 1.1022 1.1023 1.1021 1.1021 1.1025 1.0994 1.1023 1.1030 1.0967 1.1008 1.1019 1.1006 1.0988 1.0871 1.0871 1.0924 1.0906 1.0955 1.0936 1.0923 1.1107
irintensity: 0.0977 0.1718 0.6835 0.3135 0.4682 0.5189 0.4129 0.1069 0.1132 0.3029 0.2743 0.6246 0.2020 0.1147 0.0398 0.2473 0.2873 0.7458 0.8936 0.4904 0.4608 1.1490 0.4907 0.0847 0.0778 0.0916 0.1276 3.2929 0.9223 0.3519 2.5192 1.0872 3.2441 2.4782 0.0954 0.7320 2.0576 0.0788 0.3567 0.3126 0.5269 1.3192 3.0746 0.7227 0.4876 4.1889 4.0799 3.4092 1.2731 2.0754 0.1247 0.5391 3.6324 1.1592 1.9153 5.5273 0.7303 9.4071 0.6171 1.6478 4.7901 0.5870 1.1936 4.9285 11.7112 0.2552 20.5011 2.7569 14.7985 14.0834 0.5952 38.8100 87.3407 0.2630 0.0879 0.3406 16.8063 1.0071 38.7134 1.5955 3.0150 0.0687 0.0533 0.5020 39.8436 4.3982 0.4094 5.5116 5.9826 0.1293 16.7484 1.2738 1.1165 41.4089 26.6276 3.0996 28.3240 26.7690 3.0069 3.3876 30.7034 37.1201 0.6797 0.6736 2.3776 37.8953 21.9611 0.1679 0.0589 3.0185 0.5483 0.8494 20.3731 18.0849 0.5445 1.2270 0.1164 4.4225 3.0746 1.2629 2.4776 7.9445 8.3581 8.1309 2.3605 4.3222 0.9867 43.8501 9.8634 0.8232 0.0566 7.2080 0.5422 14.5155 20.4736 70.2709 102.4925 32.3677 52.8850 7.1298 1.4476 68.5977 0.3849 28.2363 15.9804 134.4410 54.9713 5.3667 4.8916 3.3367 3.5397 2.3471 9.9313 2.7031 13.2081 48.9855 11.5479 1.2910 1.3854 1.0611 1.8174 1.1742 1.2274 2.9346 8.1560 24.4717 51.3774 4.7751 24.8472 56.0030 197.2687 60.6995 0.8648 3.0800 5.2277 4.2016 0.7952 15.2917 6.0809 1.6325 8.2196 38.8284 18.4438 1.0800 2.2586 3.7888 14.1781 0.7258 1.9085 19.8517 8.1544 2.1067 0.4940 38.8807 27.8928 4.4547 0.4419 2.3566 1.0098 26.6905 8.6074 6.2847 15.7348 7.6680 1.4008 2.9618 10.4700 10.6012 2.9714 5.9500 6.7190 8.2222 78.2280 7.6422 6.5766 4.6006 0.1396 6.1858 45.1814 9.4211 1.1808 3.4707 8.0252 3.5457 5.7362 5.0209 2.5166 1.8595 5.1555 12.3344 2.3843 22.2786 7.8127 14.8422 27.2600 10.0673 11.9602 13.0810 8.9157 2.2535 11.3113 8.2671 3.9958 3.9931 1.6143 8.3249 4.8074 50.6669 46.7234 25.4145 71.5250 76.2667 233.2161 111.8693 105.5073 116.4868 69.6310 35.9329 117.1501 11.8918 6.3372 33.3425 47.2576 31.9327 87.1845 23.8835 31.5868 37.0069 10.0383 17.3868 18.2464 123.4233 5.6288 0.5085 5.1577 23.2001 0.7768 114.5318 14.5888 14.8105 24.8675 16.1616 19.3146 8.3844 9.4175 66.7051 28.8685 66.1277 22.8981 53.6377 114.5485 24.8343 37.4131 39.1866 29.0270 3.4280 2.8563 13.3324 9.8835 13.5883 14.0684 11.5812 5.0457
temp: 298.150 k
press: 1.00000 atm
elementType: 29 7 7 6 1 6 6 1 6 1 6 6 6 1 1 1 6 1 6 1 6 1 6 6 1 6 1 1 1 6 1 1 1 6 6 6 1 6 1 6 1 6 6 1 6 1 1 1 6 1 1 1 6 1 6 1 1 1 6 1 1 1 6 1 1 1 9 5 6 6 6 6 1 1 1 6 6 6 1 6 1 1 1 1 6 6 1 1 1 1 1 1 1 1 1 1 6 1 1 6 9 9 9
symmnumber: 1
zpe: 2327379.2 jmol-1
zpe.correction: 0.886452 hartree
zpe.thermalcorrener: 0.935771 hartree
zpe.thermalcorrenthalpy: 0.936715 hartree
zpe.thermalcorrgfe: 0.802884 hartree
zpe.sumelectzpe: -3694.308850 hartree
zpe.sumelectthermal: -3694.259531 hartree
zpe.sumelectthermalent: -3694.258587 hartree
zpe.sumelectthermalfe: -3694.392418 hartree
dipole: 10.4077 5.2356 5.5831
dipole: 12.9192
quadrupole: -225.1187 -275.9590 -246.4887
quadrupole: 15.0723 82.9508 33.5739
quadrupole: 24.0701 -26.7702 2.7001 15.0723 82.9508 33.5739
hfenergy: -3695.1953014 hartree
pointgroup: C01 [X(C39H56B1Cu1F4N2)]
dipole: 4.0947213 2.0598601 2.1965769 debye
polarizability: 566.1718524|-24.0401606|563.0687933|-19.1814961|-39.4929436|570.6599952 unknown
InChI: InChI=1/C27H36N2.C12H20BF4.Cu/c1-18(2)22-11-9-12-23(19(3)4)26(22)28-15-16-29(17-28)27-24(20(5)6)13-10-14-25(27)21(7)8;14-12(15,16)8-3-9-13(17)10-4-1-5-11(13)7-2-6-10;/h9-16,18-21H,1-8H3;10-11H,1-9H2;/rC39H56BCuF4N2/c1-26(2)32-18-11-19-33(27(3)4)36(32)46-24-25-47(37-34(28(5)6)20-12-21-35(37)29(7)8)38(46)41-45-40(23-13-22-39(42,43)44)30-14-9-15-31(40)17-10-16-30/h11-12,18-21,24-31H,9-10,13-17,22-23H2,1-8H3
charge 0 multiplicity 1
103 atoms
Cu 3.73894841 0.40164452 5.55023271
N  4.79935703 2.71421285 7.01766639
N  5.94562427 0.94631706 7.40030776
C  5.09016427 -0.84632532 9.4856118
H  5.19092474 0.2337622 9.60284603
C  4.86540722 1.39420493 6.71090856
C  5.81672044 3.08434099 7.88385555
H  5.92357244 4.09365558 8.23925284
C  6.54422809 1.96892501 8.12161019
H  7.41605726 1.80299114 8.72885961
C  6.41691504 -0.41394385 7.35011986
C  6.03471759 -1.28964334 8.37840552
C  5.40666687 -1.47466991 10.84706087
H  4.77784931 -1.02274253 11.61745976
H  6.45086729 -1.32076408 11.12882891
H  5.20715314 -2.54819416 10.85933059
C  6.48976264 -2.60505305 8.29865961
H  6.2133224 -3.31610773 9.06541296
C  7.28443298 -3.0226326 7.23817943
H  7.62420028 -4.05045953 7.19338384
C  7.63739052 -2.13557286 6.23276017
H  8.24700854 -2.47945096 5.40691487
C  7.20966602 -0.80673519 6.26396126
C  7.57788478 0.13994387 5.13154505
H  7.19490507 1.1311118 5.37524648
C  6.91272025 -0.29750571 3.8180173
H  7.27002651 -1.2800903 3.50163765
H  7.13522933 0.41388155 3.02000058
H  5.82702653 -0.35882678 3.9211907
C  9.09839622 0.26880156 4.96611135
H  9.55324919 -0.67866292 4.66851284
H  9.573669 0.59146471 5.89535821
H  9.33224569 1.00430389 4.19246981
C  3.81736252 3.60593449 6.45529315
C  4.14739569 4.29648721 5.27985834
C  3.15946588 5.10219986 4.71573321
H  3.36434391 5.63736066 3.79791335
C  1.90432252 5.20671722 5.29984185
H  1.14525065 5.82460351 4.83549384
C  1.61145382 4.51651248 6.46676939
H  0.62476778 4.60143438 6.90338667
C  2.56577798 3.70093502 7.07651834
C  2.22413006 2.92014196 8.33599156
H  3.14434224 2.4777282 8.71968894
C  1.65994899 3.82126664 9.44230573
H  2.34090061 4.64379903 9.67354463
H  1.50565259 3.24112034 10.35527253
H  0.69610853 4.25182815 9.16243364
C  1.26239302 1.76819362 8.01275737
H  0.31183887 2.14421264 7.6284225
H  1.05520579 1.17354643 8.90431954
H  1.68557702 1.10692868 7.25678309
C  5.50096232 4.13348009 4.6026201
H  6.18952089 3.68990573 5.32288967
C  6.10851354 5.47361151 4.16961054
H  5.53244093 5.94313863 3.36957726
H  7.1222169 5.31958929 3.79210022
H  6.16059238 6.1769293 5.00383993
C  5.39928667 3.16599817 3.41319452
H  5.03375292 2.187095 3.72573148
H  6.3785687 3.03029289 2.94761233
H  4.71339374 3.55071748 2.65597025
C  3.63540109 -1.13019237 9.07684921
H  3.38855832 -0.65051872 8.12837004
H  2.9420309 -0.75978538 9.8338382
H  3.46772408 -2.20308718 8.96064022
F  2.72425324 -0.66825626 4.35688653
B  1.21817142 -0.5401204 3.77085318
C  0.40267345 -1.61232829 4.66839002
C  1.33191695 -0.87027052 2.19478483
C  0.78155244 1.01542904 3.88794891
C  0.317953 -1.26691055 6.15693842
H  0.87412299 -2.59877208 4.55436325
H  -0.61547796 -1.72856537 4.27724433
H  1.64501255 -1.91172408 2.03290653
C  -0.07689341 -0.72289108 1.56986583
C  2.40296907 0.02982058 1.5426121
C  -0.64571167 1.13063744 3.30556113
H  0.72636538 1.34984564 4.93321785
C  1.80629251 1.93616653 3.19126685
H  -0.16712225 -0.2963913 6.28300967
H  1.32689779 -1.16607042 6.56735609
H  -0.69868209 -1.5396487 1.95188771
H  -0.03275357 -0.86648861 0.48164941
C  -0.79487613 0.61359694 1.85973727
C  2.19454752 1.54116942 1.75416896
H  2.47455925 -0.16714954 0.46407333
H  3.37260355 -0.25061919 1.9680915
H  -0.99415202 2.17181664 3.34281992
H  -1.32405059 0.56442279 3.95391108
H  2.71717014 1.94189602 3.80087494
H  1.45786444 2.97669098 3.19599652
H  -1.86036265 0.50192311 1.62900068
H  -0.43000318 1.3765136 1.17090136
H  3.11249611 2.07142307 1.47504715
H  1.43300724 1.90079682 1.06074828
C  -0.44887931 -2.30833826 6.97584551
H  0.04371449 -3.28220783 6.93246208
H  -1.46298962 -2.43296561 6.58932487
C  -0.58269324 -1.95065538 8.42968692
F  -1.27360955 -2.89041792 9.12888038
F  0.62025761 -1.82303741 9.04931504
F  -1.23590242 -0.77517217 8.62183884
