program: Gaussian 16
title: Title
version: EM64L-G16RevB.01
method: RB3LYP
basis: Gen
operation: Freq
keyword: #P
keyword: Geom=AllCheck
keyword: Guess=TCheck
keyword: SCRF=Check
keyword: GenChk
keyword: RB3LYP/ChkBas
keyword: Freq
converged: YES YES YES YES
title: Mulliken charges:
elementType: O C C H H H H C H H C C C H H H H H H C Cs F F F
charge: -0.683419 -0.219230 -0.266656 0.088042 0.083948 0.114725 0.127632 -0.275282 0.147943 0.148314 0.256685 -0.392939 -0.425161 0.102232 0.102841 0.109065 0.096597 0.084345 0.083310 0.452562 0.811189 -0.180221 -0.186352 -0.180169
chargesum: -0.00000
title: Mulliken charges with hydrogens summed into heavy atoms:
elementType: O C C C C C C C Cs F F F
charge: -0.683419 -0.047241 -0.024299 0.020974 0.256685 -0.110191 -0.129518 0.452562 0.811189 -0.180221 -0.186352 -0.180169
chargesum: 0.00000
polarizability: 1.39425428e+02 2.69853606e+00 1.24120239e+02 8.06659635e-01 2.64149396e+00 1.44049521e+02
1716.lowfreq: -4.2150 -0.0007 -0.0004 -0.0003 4.9307 6.4503 18.3094 22.4414 58.8254
frequency: 18.1469 22.3939 58.8131 60.5269 84.6999 117.5992 133.6447 149.3264 210.4096 229.7963 242.1403 280.1012 343.6530 350.8315 364.8180 421.1734 449.1239 486.1947 529.6487 534.9879 575.7364 645.7883 748.3519 759.7849 819.3860 844.6707 875.8513 892.5612 976.3207 1003.9774 1012.5089 1038.4040 1051.6617 1078.5929 1103.7346 1171.4133 1196.6526 1212.6460 1237.9006 1253.8127 1282.6783 1321.1209 1333.9427 1364.9853 1372.3046 1392.0389 1397.2672 1469.5632 1475.4531 1478.8439 1484.4729 1489.4673 1501.1229 1510.1385 2986.9653 2995.3683 3005.9289 3021.5465 3042.1617 3054.7208 3057.0223 3065.0777 3074.5037 3079.1163 3082.7421 3102.5416
redmass: 14.4912 10.5789 3.8438 4.8843 4.9397 3.8758 2.1827 4.0158 4.0642 4.9849 1.0918 1.0752 2.9685 2.8964 3.6628 3.9601 2.6462 3.1948 5.5615 7.4231 4.3531 7.0540 1.3950 2.4251 2.2852 2.7076 1.7706 1.7028 1.5108 2.5253 2.0213 3.5155 2.5494 1.6904 4.3822 2.7916 2.5794 3.0288 1.7881 3.3176 1.5711 1.2684 1.1444 1.5049 1.2565 1.2523 1.6422 1.0774 1.1019 1.0600 1.0538 1.0543 1.0512 1.0988 1.0561 1.0378 1.0400 1.1008 1.0601 1.0611 1.0962 1.0973 1.1015 1.1016 1.1012 1.1048
irintensity: 4.6650 2.5765 10.6188 8.5974 1.6125 6.7703 3.6919 26.4582 9.3251 5.8398 0.7015 0.2527 6.6471 5.5834 1.2473 24.2965 25.9375 14.8308 12.0096 0.3803 0.7502 13.8976 0.6250 1.4487 5.6804 18.4447 4.1349 9.0924 36.2961 272.4281 16.5051 86.2966 5.1714 36.4653 162.7649 45.3903 163.9040 186.1086 7.1911 209.3201 117.6694 68.8339 2.8441 13.6371 25.5446 16.3035 25.6419 2.4216 7.6637 1.7721 2.1432 3.1052 2.7116 6.1839 44.6205 60.3309 83.6288 41.8704 16.7088 20.9141 20.0107 130.5686 70.9035 56.1638 43.5001 38.1315
temp: 298.150 k
press: 1.00000 atm
elementType: 8 6 6 1 1 1 1 6 1 1 6 6 6 1 1 1 1 1 1 6 55 9 9 9
symmnumber: 1
zpe: 484660.3 jmol-1
zpe.correction: 0.184597 hartree
zpe.thermalcorrener: 0.199063 hartree
zpe.thermalcorrenthalpy: 0.200007 hartree
zpe.thermalcorrgfe: 0.138763 hartree
zpe.sumelectzpe: -669.017994 hartree
zpe.sumelectthermal: -669.003528 hartree
zpe.sumelectthermalent: -669.002584 hartree
zpe.sumelectthermalfe: -669.063829 hartree
dipole: 3.4258 0.6606 10.0209
dipole: 10.6109
quadrupole: -104.7313 -89.1079 -107.3571
quadrupole: -2.7931 6.6465 9.0620
quadrupole: -4.3325 11.2909 -6.9583 -2.7931 6.6465 9.0620
hfenergy: -669.2025912 hartree
pointgroup: C01 [X(C7H12Cs1F3O1)]
dipole: 1.3478316 0.2598876 3.9425202 debye
dipolederiv: -1.3385928 -0.1449706 -0.552189 -0.1455161 -0.8566738 -0.1737065 -0.5752959 -0.186525 -1.7327279 0.0322562 -0.0038469 0.1716652 0.0228968 0.086105 -0.0806854 0.1328211 -0.0539436 -0.0692867 0.0783673 -0.0703554 -0.0073159 -0.067893 0.0723307 -0.035012 0.0601317 0.0084809 0.0658868 -0.0687928 -0.0626933 -0.118995 -0.0591094 0.0251796 -0.0212889 -0.132206 -0.070817 -0.1979862 -0.0442409 0.118924 0.0002931 0.0812767 -0.1947863 0.0386986 -0.0244122 0.0727812 0.0430254 -0.0128085 -0.0248718 -0.0970972 -0.00628 0.0222704 -0.0538411 -0.1262341 -0.064086 0.0206607 0.0266951 0.0667076 -0.0160627 0.0586416 -0.1147665 0.0527837 -0.0019634 0.0654394 0.0102401 -0.1235566 -0.0850435 0.1199924 -0.1391509 -0.0281879 0.073492 0.0779786 0.0158262 0.0229273 0.0243054 -0.0327702 -0.0655415 -0.010862 0.0743957 -0.0262076 -0.0224106 -0.0344288 -0.0725451 0.016285 0.0531309 0.0012093 0.0736035 -0.0474766 0.0279975 -0.0225726 0.0701184 0.0592141 0.8790867 0.1021798 0.3091075 0.0532701 0.5769149 0.0779177 0.2763332 0.0365697 0.9980873 -0.0652858 -0.1592695 0.0418758 -0.1688948 -0.0687993 0.0231 0.0977207 0.0751977 0.0945583 0.0011928 0.1010199 -0.0414725 0.1677681 -0.138391 0.0957113 -0.0149593 0.0579646 0.0674378 -0.0525749 0.0640809 0.1138197 0.0428127 0.0347539 -0.0409177 0.1659751 -0.0957496 -0.12347 -0.0473316 0.0128792 0.1172737 0.0604746 0.0308636 -0.0845061 0.1647487 -0.0315109 -0.1355057 -0.0456346 -0.1581361 0.0375937 -0.1141749 -0.1213376 0.0681067 0.014283 0.0515153 0.0471027 -0.0108156 0.1534855 -0.0400769 0.0723756 -0.1646284 0.0596785 -0.0209752 0.0637873 0.0396083 -0.0842246 0.0281304 -0.1644128 -0.0093444 0.0354787 -0.019691 -0.1897455 0.0228131 -0.1521856 -0.1085867 -0.0877368 -0.1367998 -0.0692267 0.0182818 -0.0372245 -0.183357 -0.0788258 -0.1129643 1.875078 -0.0395408 -0.1423793 0.0226753 1.6972134 -0.0717993 -0.0992427 -0.0085834 1.8468749 1.0174134 0.0740212 0.3114323 0.0761752 0.8255377 0.1092321 0.3052261 0.1033927 1.2730652 -0.7820251 0.173653 0.4571544 0.1159844 -0.4756366 -0.1665835 0.4022716 -0.2076602 -0.7688706 -0.7125144 -0.1414213 -0.3048328 -0.1734533 -0.3933476 -0.1206927 -0.2493281 -0.0852249 -0.738269 -0.4536949 0.0624439 0.0057582 0.1159507 -0.8952936 0.3054381 -0.0347871 0.2734688 -0.484878 unknown
polarizability: 139.4254281|2.6985361|124.1202387|0.8066596|2.641494|144.049521 unknown
InChI: InChI=1/C7H12F3O.Cs/c1-6(2,11)4-3-5-7(8,9)10;/h3-5H2,1-2H3;/q-1;+1/rC7H12CsF3O/c1-6(2,12-8)4-3-5-7(9,10)11/h3-5H2,1-2H3
charge 0 multiplicity 1
24 atoms
O  -1.39555223 -0.04473468 -1.22462911
C  -1.43813911 -0.76299931 -3.53900148
C  -0.31650236 0.18077251 -3.96917682
H  -2.11768501 -0.94301191 -4.38186334
H  -0.9984619 -1.73158686 -3.27244758
H  0.25242137 0.44770333 -3.07628304
H  -0.73230055 1.10554196 -4.37674937
C  0.60829255 -0.45425223 -5.01125032
H  0.06624842 -0.69046558 -5.93043159
H  1.03260557 -1.38824205 -4.63458651
C  -2.23594499 -0.27321595 -2.28554163
C  -3.26315544 -1.380829 -1.94316793
C  -3.0281842 1.01039303 -2.64746076
H  -3.64110335 1.30710099 -1.79148726
H  -3.852983 -1.07513752 -1.07417878
H  -2.34304129 1.83496008 -2.85899288
H  -2.73677085 -2.30321617 -1.68067574
H  -3.69063841 0.88264622 -3.51171204
H  -3.95438239 -1.60133101 -2.76534875
C  1.7716567 0.41516746 -5.40761525
Cs 0.11627278 0.48811291 0.87091667
F  2.56514163 -0.18880594 -6.33138964
F  2.57941871 0.7208302 -4.35762292
F  1.38793431 1.59766187 -5.94985201
