program: Gaussian 09
title: 000073136
version: EM64L-G09RevD.01
frameworkgroup: C1[X(C15H10N2O)]
method: RPBEPBE
basis: SDD
operation: Freq
keyword: #p
keyword: freq=noraman
keyword: PBEPBE/SDD
title: #p freq=noraman PBEPBE/SDD
converged: YES YES NO YES
title: Mulliken charges:
elementType: O N N C C C C C C C C C C C C C C C H H H H H H H H H H
charge: -0.098416 -0.095616 -0.095568 -0.002857 -0.002945 0.334537 0.334650 -0.363903 -0.363921 -0.352556 -0.352573 -0.075663 -0.233843 -0.233881 -0.230016 -0.230015 -0.228572 -0.228564 0.267908 0.267939 0.277282 0.277293 0.237972 0.237972 0.238679 0.238680 0.237997 0.237998
chargesum: 0.00000
title: Mulliken charges with hydrogens summed into heavy atoms:
elementType: O N N C C C C C C C C C C C C C C C
charge: -0.098416 -0.095616 -0.095568 -0.002857 -0.002945 0.334537 0.334650 -0.095995 -0.095982 -0.075274 -0.075280 -0.075663 0.004130 0.004091 0.008663 0.008665 0.009426 0.009434
polarizability: 2.29565011e+02 -6.51253675e-03 2.52075700e+02 -1.85916425e+01 -6.87165973e-03 9.15869108e+01
1716.lowfreq: -5.5247 -0.0007 -0.0002 -0.0001 5.5037 7.0173 44.4019 51.5753 73.5509
frequency: 44.3811 51.5734 73.5508 85.8469 126.5948 132.9636 193.3452 231.1800 258.7648 260.1088 367.2087 368.4460 399.3476 410.3597 439.7888 478.8739 540.4907 610.9358 612.1503 628.7619 656.2530 656.6391 694.9224 698.5659 713.7470 735.0684 748.4615 779.6845 791.3975 815.8378 855.3701 860.0373 863.9906 941.0563 944.0574 983.8830 985.1035 987.7296 988.7198 988.7654 994.0454 1005.4372 1006.5000 1030.8413 1034.7557 1087.7643 1090.4476 1176.8315 1176.9504 1192.7386 1195.9813 1272.1140 1275.9626 1319.3629 1325.5923 1381.0994 1381.4598 1433.5332 1434.7014 1456.0147 1476.8646 1501.7755 1538.2211 1575.2966 1580.8099 1607.2499 1608.5589 1677.9608 3134.5978 3134.6856 3145.6427 3146.0780 3157.4978 3158.2337 3167.3610 3168.2182 3175.5706 3176.2487
redmass: 3.8438 4.7337 4.8704 6.9123 6.2940 5.9405 7.7944 5.3734 5.5306 7.0972 6.7020 5.4884 2.8328 2.8768 8.1897 3.7665 4.6358 6.4613 6.4734 7.9877 7.1376 7.6217 1.7848 2.1864 2.8691 7.1115 6.4250 2.0260 3.1757 6.7592 1.2494 1.2419 9.0964 1.4018 1.4238 5.9824 3.4186 1.9109 5.8760 1.4423 5.1270 1.3415 1.3824 2.0480 2.0017 1.6001 1.6304 1.0575 1.0566 1.1156 1.1182 4.3146 4.2851 1.3838 1.3845 6.5449 7.2943 2.3671 2.4347 3.1547 2.3300 4.2666 8.4292 5.6636 6.1729 5.9678 5.9166 12.8479 1.0856 1.0856 1.0888 1.0889 1.0932 1.0932 1.0963 1.0959 1.1011 1.1007
irintensity: 0.9139 0.2346 0.1578 0.3678 0.5275 0.9199 0.0366 0.0817 0.1416 0.1253 0.0698 5.9939 2.1048 0.6833 2.0215 1.3973 34.7617 1.1083 0.0019 4.0920 0.6460 0.4672 97.0776 10.3077 3.0626 1.7731 2.9103 85.0949 0.0078 73.1459 4.6136 5.2443 232.4344 5.1531 0.2580 0.8186 102.8355 80.6921 13.5283 0.8786 11.2464 0.9966 0.6601 1.5012 1.2148 5.4535 7.2845 0.4173 0.0555 15.3472 3.7794 60.4777 8.1019 8.4067 2.8254 1.3114 5.1657 43.7521 21.9517 239.2503 10.0835 224.4493 49.3054 1.2995 4.0853 80.3391 28.5459 161.4263 0.0317 0.1278 6.2524 5.8406 24.9384 10.5313 22.8915 2.2232 14.2166 18.4888
temp: 298.150 k
press: 1.00000 atm
elementType: 8 7 7 6 6 6 6 6 6 6 6 6 6 6 6 6 6 6 1 1 1 1 1 1 1 1 1 1
symmnumber: 1
zpe: 546735.1 jmol-1
zpe.correction: 0.208240 hartree
zpe.thermalcorrener: 0.222058 hartree
zpe.thermalcorrenthalpy: 0.223002 hartree
zpe.thermalcorrgfe: 0.166481 hartree
zpe.sumelectzpe: -761.074937 hartree
zpe.sumelectthermal: -761.061120 hartree
zpe.sumelectthermalent: -761.060176 hartree
zpe.sumelectthermalfe: -761.116697 hartree
dipole: 0.0001 -8.3718 0.0008
dipole: 8.3718
quadrupole: -86.5906 -119.2289 -101.9796
quadrupole: -0.0004 -4.9295 0.0021
quadrupole: 16.0091 -16.6292 0.6201 -0.0004 -4.9295 0.0021
hfenergy: -761.2831776 hartree
pointgroup: C01 [X(C15H10N2O1)]
dipole: -0.0247135 -3.2936217 0.0013279 debye
polarizability: 229.4977045|0.1573282|252.0745907|-18.8434972|0.0854891|91.6553263 unknown
InChI: InChI=1S/C15H10N2O/c18-15-16-13(11-7-3-1-4-8-11)14(17-15)12-9-5-2-6-10-12/h1-10H
charge 0 multiplicity 1
28 atoms
O  0.031416 4.332269 -0.001694
N  1.229688 2.245304 -0.084231
N  -1.198019 2.26362 0.082902
C  0.785511 0.996595 -0.029641
C  -0.772654 1.008341 0.029431
C  1.705629 -0.147071 0.038995
C  -1.709768 -0.121475 -0.038879
C  1.383738 -1.333993 0.758416
C  -1.404854 -1.313709 -0.756911
C  2.995595 -0.024947 -0.556392
C  -2.998252 0.020231 0.555411
C  0.022148 3.091983 -0.000566
C  2.327264 -2.376855 0.865324
C  -2.363523 -2.34273 -0.863392
C  3.925051 -1.076868 -0.462964
C  -3.943011 -1.018034 0.46236
C  3.594007 -2.257402 0.247838
C  -3.628793 -2.204066 -0.246928
H  0.415596 -1.428094 1.258913
H  -0.437904 -1.422587 -1.256691
H  3.241887 0.904024 -1.080049
H  -3.231223 0.953264 1.077936
H  2.076684 -3.278571 1.433939
H  -2.125818 -3.24862 -1.430897
H  4.908738 -0.978512 -0.933978
H  -4.925509 -0.904725 0.932498
H  4.321322 -3.072943 0.325886
H  -4.367946 -3.008928 -0.324634
