program: Gaussian 09
title: 000073119
version: EM64L-G09RevD.01
frameworkgroup: C1[X(C6H6N4O2S)]
method: RPBEPBE
basis: SDD
operation: Freq
keyword: #p
keyword: freq=noraman
keyword: PBEPBE/SDD
title: #p freq=noraman PBEPBE/SDD
converged: NO YES NO NO
title: Mulliken charges:
elementType: S O O N N N N C C C C C C H H H H H H
charge: 0.531837 -0.243746 -0.199572 -0.165762 -0.228988 -0.411290 -0.321264 0.191001 0.018749 0.242197 0.208963 -0.599347 -0.592283 0.274116 0.254204 0.254222 0.257137 0.257346 0.272479
chargesum: 0.00000
title: Mulliken charges with hydrogens summed into heavy atoms:
elementType: S O O N N N N C C C C C C
charge: 0.531837 -0.243746 -0.199572 -0.165762 -0.228988 -0.411290 -0.321264 0.191001 0.018749 0.242197 0.208963 0.183196 0.194680
polarizability: 1.67495005e+02 3.04440534e+00 1.26590526e+02 3.79388918e-02 -1.95532291e-02 5.40733184e+01
1716.lowfreq: -10.6207 -0.0030 -0.0027 -0.0020 5.7355 8.8274 71.2490 90.8807 106.3216
frequency: 71.2420 90.8711 106.3200 124.7752 156.4952 170.0321 245.0252 289.4230 301.1259 335.0888 358.9065 388.0100 401.0893 454.0097 475.6201 492.3420 543.9237 648.6677 653.4537 690.3595 703.1533 706.5992 768.1657 772.6902 939.3539 957.3468 1056.9291 1104.4139 1128.0376 1132.3489 1201.0152 1228.2126 1258.6118 1308.2834 1345.9102 1403.9990 1424.4831 1449.1219 1473.6889 1475.0090 1476.6059 1478.4224 1528.4269 1600.5285 1637.8229 3011.7187 3020.2506 3102.1910 3115.0395 3148.3113 3149.0928
redmass: 6.0452 1.1514 2.7388 1.1394 4.3339 10.2283 6.2705 5.7270 3.2722 7.8146 4.9191 7.5531 8.3106 9.6728 12.5139 8.3534 12.0602 9.5155 11.1094 13.6625 13.6717 10.8847 5.2003 11.8287 4.1402 3.8487 2.5539 3.6097 1.3096 1.3014 5.7676 3.7048 3.6850 7.8514 7.0386 1.6771 1.2576 2.7668 1.0632 1.0779 1.0410 1.1252 5.7119 11.0645 9.7301 1.0336 1.0328 1.1027 1.1026 1.1015 1.1027
irintensity: 0.2555 1.1780 4.5854 1.7205 2.4118 3.4922 2.3758 0.0403 0.9450 0.5808 10.9833 35.3734 0.2557 13.5033 17.3434 3.5276 14.6336 1.0757 1.5575 0.3570 28.8174 13.6217 0.2456 6.6945 3.1789 19.8988 57.4520 24.8446 0.1025 0.1865 64.6959 9.7014 94.1677 115.0071 12.8410 3.6070 55.6443 109.1527 14.0341 10.1427 18.1049 15.4987 283.7661 531.6840 173.9334 20.5640 18.2271 13.5829 13.1280 0.7834 0.9983
temp: 298.150 k
press: 1.00000 atm
elementType: 16 8 8 7 7 7 7 6 6 6 6 6 6 1 1 1 1 1 1
symmnumber: 1
zpe: 335567.9 jmol-1
zpe.correction: 0.127811 hartree
zpe.thermalcorrener: 0.139557 hartree
zpe.thermalcorrenthalpy: 0.140501 hartree
zpe.thermalcorrgfe: 0.089712 hartree
zpe.sumelectzpe: -998.803740 hartree
zpe.sumelectthermal: -998.791994 hartree
zpe.sumelectthermalent: -998.791050 hartree
zpe.sumelectthermalfe: -998.841839 hartree
dipole: -0.0469 2.6586 -0.0025
dipole: 2.6590
quadrupole: -82.0370 -91.9685 -80.0443
quadrupole: -5.8295 -0.0084 0.0065
quadrupole: 2.6462 -7.2852 4.6390 -5.8295 -0.0084 0.0065
hfenergy: -998.9315508 hartree
pointgroup: C01 [X(C6H6N4O2S1)]
dipole: -0.0435878 1.0452087 0.0007293 debye
dipolederiv: -0.1960842 -0.1383946 0.0001492 -0.1388043 0.149647 0.0000279 0.0001943 0.0000589 0.2602761 -1.1874175 0.2905767 0.0002522 0.3352118 -0.7107755 -0.000129 -0.0002909 0.0003036 -0.3503684 -0.5110672 -0.0809798 0.0000044 -0.0073089 -1.1375729 -0.0001104 0.0006199 -0.0002958 -0.3187304 -1.4247412 0.0424348 0.0001348 -0.0482886 -0.6822191 0.0002775 0.0007122 0.000118 -0.1630244 -0.8089378 0.3848588 -0.0003231 0.2035205 -1.3025516 -0.0003062 0.0018338 0.0001605 -0.2123029 -0.2814406 0.2350537 -0.0001005 -0.4834926 -0.0886885 0.0000787 0.0002122 -0.0001372 -0.2926892 0.470324 0.1323485 -0.0002507 0.3201485 -0.1695813 -0.0000565 -0.0004484 -0.0001113 -0.2442314 0.8484613 -0.5036213 -0.0000415 -0.6046642 0.0526293 0.0002027 -0.0000337 0.0003541 0.1678183 -0.6446995 -0.2263524 0.0004248 0.2408717 -0.1242727 -0.0001287 -0.0001136 0.0001189 0.0739033 1.8047803 -0.0246325 -0.0000137 0.0659947 1.5310661 -0.0003521 -0.0000227 -0.0006508 0.2841254 1.2599327 -0.2305094 -0.0004246 -0.1029391 1.5032227 0.0007803 -0.000349 0.0008922 0.2631826 0.0171663 -0.0044348 0.0000781 0.0236914 0.4819855 -0.0002044 -0.0000384 -0.0002863 0.1992581 0.3193758 0.1275705 0.0012302 0.2059456 0.1077764 0.0006174 0.0002867 0.0012225 0.1923041 0.0155759 0.1253319 0.0001187 -0.0033661 0.1368593 0.0000256 0.0001231 -0.0000195 0.1328412 0.0702127 -0.0797627 0.0896268 -0.0054294 0.0250278 0.0062453 0.0656544 0.0504675 -0.0329074 0.0699705 -0.0799797 -0.0897387 -0.0055568 0.0250947 -0.0062895 -0.0658294 -0.0503012 -0.0324585 0.004977 -0.0268656 -0.0485797 0.0281168 0.1043227 0.0732573 -0.0715499 0.026788 -0.0317626 0.0061328 -0.0254785 0.048912 0.0318636 0.1038052 -0.0760907 0.0699544 -0.0297145 -0.0267414 0.1674786 0.0828365 -0.0014588 -0.0555144 -0.0057749 0.0021548 -0.0009149 0.0010323 0.1315076 unknown
polarizability: 167.7115887|-0.6022324|126.3739596|-0.0087776|0.0043598|54.0733008 unknown
InChI: InChI=1S/C6H6N4O2S/c1-9-4-3(7-13-8-4)5(11)10(2)6(9)12/h1-2H3
charge 0 multiplicity 1
19 atoms
S  3.367202 0.006989 -0.000187
O  -2.590219 1.358441 0.001095
O  -0.383447 -2.78041 0.000565
N  -0.251033 1.407838 0.000755
N  -1.461623 -0.689812 0.002411
N  2.14921 1.33005 -0.000103
N  2.178425 -1.328351 0.000442
C  0.947644 0.710301 0.000465
C  0.962828 -0.750991 0.000662
C  -1.496901 0.733291 0.001664
C  -0.301264 -1.526958 0.0009
C  -0.228498 2.887858 -0.0002
C  -2.791335 -1.353259 0.003375
H  -1.269759 3.238428 0.00061
H  0.300294 3.252526 -0.896467
H  0.302137 3.253556 0.894542
H  -3.356259 -1.063045 -0.89676
H  -3.364527 -1.041572 0.890776
H  -2.617774 -2.438281 0.016156
