program: Gaussian 09
title: 000073210
version: EM64L-G09RevD.01
frameworkgroup: C1[X(C18H16O6)]
method: RPBEPBE
basis: SDD
operation: Freq
keyword: #pfreq=noraman
keyword: PBEPBE/SDD
title: #p freq=noraman PBEPBE/SDD
converged: YES YES NO NO
title: Mulliken charges:
elementType: O O O O O O C C C C C C C C C C C C C C C C C C H H H H H H H H H H H H H H H H
charge: -0.257853 -0.259008 -0.283558 -0.296587 -0.425906 -0.344170 0.166948 0.053301 -0.014192 0.054505 0.116501 0.064008 0.272913 0.236405 -0.435902 0.315781 -0.369211 -0.356475 -0.238970 -0.222516 -0.520828 -0.234157 -0.519106 -0.516543 0.254593 0.230072 0.285962 0.385963 0.233463 0.233562 0.228953 0.261698 0.215593 0.235360 0.224429 0.273902 0.228034 0.214564 0.226885 0.281590
chargesum: 0.00000
title: Mulliken charges with hydrogens summed into heavy atoms:
elementType: O O O O O O C C C C C C C C C C C C C C C C C C
charge: -0.257853 -0.259008 -0.283558 -0.296587 -0.039942 -0.344170 0.166948 0.053301 -0.014192 0.054505 0.116501 0.064008 0.272913 0.236405 -0.181309 0.315781 -0.139140 -0.070513 -0.005507 0.011046 0.185415 0.001203 0.207259 0.206495
polarizability: 3.85833005e+02 -1.18791872e+01 2.60073266e+02 -2.20808191e+00 -2.14748417e+00 1.02603075e+02
1716.lowfreq: -8.5093 -0.5193 -0.0002 0.0002 0.0006 2.7251 27.4403 34.5836 60.2577
frequency: 27.4268 34.5603 60.2376 65.0919 77.5675 83.1719 90.9639 103.5266 113.7813 142.9344 149.3474 154.3520 165.1591 187.3219 203.2518 209.4710 229.4223 249.9618 265.5199 289.7928 307.2152 325.0546 353.1526 369.8160 397.7379 400.9470 423.6455 426.2904 461.9520 480.3661 487.0844 511.0803 566.0584 600.6498 612.8161 617.6947 642.8583 663.6181 683.4565 691.9996 717.6882 738.0392 783.1885 790.7132 839.6451 842.2222 847.3259 861.5919 892.5675 911.4581 941.4276 962.5067 970.3207 987.9697 989.0542 991.0265 1008.2318 1025.5482 1042.1401 1078.2347 1089.8345 1106.7303 1108.2231 1113.2367 1115.1716 1153.2820 1156.9202 1158.6552 1177.1428 1195.3343 1207.2836 1239.3543 1283.8565 1301.8816 1327.3049 1347.6105 1376.4901 1381.8578 1394.6234 1397.0613 1414.8045 1432.4720 1433.9768 1440.6201 1449.0381 1454.8413 1457.2576 1460.4104 1480.1695 1480.8618 1482.9438 1484.3396 1541.5325 1570.4837 1574.7943 1589.0506 1613.7953 1652.0639 2577.4337 2974.9883 2985.1705 2988.4580 3081.1549 3096.6390 3098.3354 3125.5979 3132.7685 3135.5521 3135.9377 3142.3364 3154.4210 3166.6168 3177.4008 3197.6219
redmass: 3.6599 5.1058 2.7760 3.1835 4.0007 4.9059 2.2797 2.8765 2.5851 1.6187 2.2115 1.5223 1.5212 3.5683 5.1329 5.0977 5.5683 6.1087 7.9417 5.3236 6.5544 5.7865 8.0528 6.1878 3.6116 4.5903 7.8085 6.5426 4.5972 7.8570 7.1505 8.0502 9.4516 7.1602 6.4898 6.5654 4.7002 7.4362 9.3436 1.8202 3.6344 7.8528 1.8565 9.7164 6.8900 4.0455 1.8456 1.3673 7.9897 8.6055 1.4298 8.4165 1.0643 2.8739 1.9327 6.3859 1.3367 3.0566 3.0209 6.4239 1.6948 1.4297 1.6388 1.3190 1.8897 1.3713 1.4763 1.4261 1.0578 1.4046 2.5711 1.9253 3.6141 4.3783 1.4827 4.4456 6.7988 4.6458 4.5115 2.7698 1.9647 1.3389 1.3000 2.2460 1.6312 1.1096 1.0793 1.3044 2.0108 1.1230 1.0550 1.0541 6.5176 4.9008 5.7139 6.0207 5.8959 3.8963 1.0759 1.0324 1.0328 1.0317 1.1009 1.0993 1.1012 1.1039 1.0853 1.1056 1.1053 1.0885 1.0937 1.0974 1.0989 1.0916
irintensity: 0.0637 1.4083 1.8624 2.8382 2.4491 2.4538 3.3456 8.7893 1.1789 2.4987 1.0973 1.0052 3.9688 1.5857 7.9600 2.0489 14.4253 1.3786 3.5787 3.8071 3.0158 4.5928 8.0946 2.0093 5.6846 9.9430 6.1010 5.3753 4.4460 3.0159 2.4612 6.9645 12.6240 13.7451 2.4806 5.0320 11.9268 22.2656 1.3274 39.1489 10.4378 10.6305 57.2802 7.4871 3.9082 11.4588 16.3272 9.7012 7.5211 37.0748 4.7018 54.0357 127.4863 9.9545 16.0523 91.3857 0.6545 79.2636 68.0177 134.5635 32.6317 15.0023 6.2213 18.5902 27.5170 0.4941 13.4174 17.6361 0.7091 11.0830 31.6680 68.2272 22.4564 228.6640 2.8333 485.6099 3.8650 54.1072 27.8773 308.9231 183.3659 103.6136 22.9391 60.7592 128.0272 19.6124 15.0282 78.9583 15.9576 21.3865 15.9986 32.9093 19.0916 83.1322 235.0313 51.0010 4.4553 140.4619 492.4196 69.8732 92.7649 82.9632 30.3232 35.4284 24.1007 16.9919 0.7137 6.9552 17.2021 5.3278 23.7119 20.4030 14.5115 2.5001
temp: 298.150 k
press: 1.00000 atm
elementType: 8 8 8 8 8 8 6 6 6 6 6 6 6 6 6 6 6 6 6 6 6 6 6 6 1 1 1 1 1 1 1 1 1 1 1 1 1 1 1 1
symmnumber: 1
zpe: 789314.0 jmol-1
zpe.correction: 0.300634 hartree
zpe.thermalcorrener: 0.323007 hartree
zpe.thermalcorrenthalpy: 0.323951 hartree
zpe.thermalcorrgfe: 0.248484 hartree
zpe.sumelectzpe: -1145.084610 hartree
zpe.sumelectthermal: -1145.062237 hartree
zpe.sumelectthermalent: -1145.061293 hartree
zpe.sumelectthermalfe: -1145.136759 hartree
dipole: -1.9392 3.0900 1.3928
dipole: 3.9049
quadrupole: -105.8443 -140.6743 -139.7597
quadrupole: 4.9179 1.2529 -1.3609
quadrupole: 22.9151 -11.9149 -11.0003 4.9179 1.2529 -1.3609
hfenergy: -1145.3852438 hartree
pointgroup: C01[X(C18H16O6)]
dipole: 0.8085293 -1.1779214 0.5648671 debye
polarizability: 386.5392272|-7.2778273|259.4106816|1.1476326|-0.4034189|102.5594369 unknown
InChI: InChI=1S/C18H16O6/c1-21-16-14(20)13-11(19)9-12(10-7-5-4-6-8-10)24-15(13)17(22-2)18(16)23-3/h4-9,20H,1-3H3
charge 0 multiplicity 1
40 atoms
O  1.103181 -0.460465 0.024621
O  -0.525073 -2.667897 -0.058158
O  -3.315133 -2.350957 0.056202
O  -4.498618 0.199233 -0.038422
O  -2.766968 2.522112 -0.142639
O  -0.396787 3.428226 -0.154261
C  -0.824479 1.060258 -0.047545
C  -0.287339 -0.25344 0.002533
C  -1.113737 -1.39657 0.013003
C  -2.24366 1.246065 -0.069558
C  -2.527364 -1.19689 -0.007177
C  -3.099276 0.114401 -0.015705
C  1.976534 0.629316 -0.033427
C  0.075036 2.212132 -0.100111
C  1.494871 1.925517 -0.095307
C  3.390571 0.2027 -0.024358
C  4.441738 1.156785 0.070999
C  3.71867 -1.17955 -0.113899
C  5.786384 0.738421 0.072592
C  5.066469 -1.592047 -0.110965
C  -0.761961 -3.548518 1.110502
C  6.105798 -0.637484 -0.018657
C  -4.315062 -2.545727 -1.023666
C  -5.136345 1.158824 0.896199
H  2.180864 2.771575 -0.154272
H  4.215632 2.224627 0.153822
H  2.911125 -1.912966 -0.189819
H  -1.944602 3.173338 -0.16611
H  6.585946 1.482985 0.148263
H  5.306638 -2.658176 -0.183447
H  -0.237621 -4.486496 0.873006
H  -1.841629 -3.731315 1.241608
H  -0.331586 -3.095884 2.024371
H  7.152629 -0.960183 -0.016639
H  -3.796298 -2.646736 -1.994768
H  -5.025266 -1.704507 -1.045804
H  -4.825684 -3.486233 -0.768627
H  -4.870988 0.903295 1.939229
H  -6.217064 1.025421 0.737822
H  -4.824547 2.188408 0.663068
