program: Gaussian 09
title: 000061774
version: EM64L-G09RevD.01
frameworkgroup: C1[X(C6H8O2)]
method: RPBEPBE
basis: SDD
operation: Freq
keyword: #p
keyword: freq=noraman
keyword: PBEPBE/SDD
title: #p freq=noraman PBEPBE/SDD
converged: NO YES NO NO
title: Mulliken charges:
elementType: O O C C C C C C H H H H H H H H
charge: -0.282554 -0.246745 -0.064968 -0.335153 -0.732548 0.247509 0.048045 -0.571741 0.252158 0.261037 0.233761 0.237228 0.237268 0.256930 0.225493 0.234281
chargesum: 0.00000
title: Mulliken charges with hydrogens summed into heavy atoms:
elementType: O O C C C C C C
charge: -0.282554 -0.246745 0.187190 -0.074117 -0.024291 0.247509 0.304975 -0.111967
polarizability: 1.44309461e+02 -1.23310509e+01 6.63857880e+01 2.08379067e-03 5.48961359e-03 3.56434077e+01
1716.lowfreq: -0.0006 -0.0004 0.0005 4.6962 6.4829 13.8488 75.2566 115.9599 117.1775
frequency: 75.1763 115.9596 117.1757 148.6377 205.8879 227.9676 242.0525 360.8867 392.5886 445.6046 650.8142 696.9577 709.9224 840.7796 841.3882 904.7154 913.4092 972.9075 989.8660 990.3340 1053.7753 1089.7249 1114.2442 1146.3839 1277.9295 1293.7304 1301.6755 1394.5808 1395.2294 1456.6427 1463.7185 1637.3952 1649.9321 1668.9624 2971.2977 3043.8366 3087.5801 3110.8245 3120.9786 3157.3737 3159.8500 3238.6254
redmass: 2.8894 3.5736 2.0399 1.4714 1.8224 2.9175 4.0675 4.1741 4.2370 3.2849 3.3373 1.5402 4.5905 1.8211 3.3040 1.3904 1.8590 1.1110 1.0809 3.5201 1.6028 2.0654 2.6719 3.0629 1.1756 1.3552 1.5061 1.1715 1.2214 1.0471 1.0737 9.1341 5.3058 5.6043 1.0374 1.0956 1.0966 1.0939 1.0584 1.0997 1.0924 1.1157
irintensity: 1.5769 1.7430 4.1477 0.0880 0.5232 3.1730 10.5638 1.8635 2.4844 2.1176 13.3758 2.8676 5.1788 1.9310 17.3284 88.6709 13.8180 38.1345 69.5373 203.0604 0.2250 152.1152 231.1873 134.9029 4.7759 55.0338 45.6462 4.9558 13.5459 17.7916 50.5059 181.7378 145.9343 46.1351 14.7145 15.8768 8.3496 16.5153 0.8689 14.7794 7.6503 9.5705
temp: 298.150 k
press: 1.00000 atm
elementType: 8 8 6 6 6 6 6 6 1 1 1 1 1 1 1 1
symmnumber: 1
zpe: 327043.0 jmol-1
zpe.correction: 0.124564 hartree
zpe.thermalcorrener: 0.133616 hartree
zpe.thermalcorrenthalpy: 0.134561 hartree
zpe.thermalcorrgfe: 0.090491 hartree
zpe.sumelectzpe: -383.236677 hartree
zpe.sumelectthermal: -383.227625 hartree
zpe.sumelectthermalent: -383.226681 hartree
zpe.sumelectthermalfe: -383.270750 hartree
dipole: -1.7148 -1.5119 0.0026
dipole: 2.2862
quadrupole: -32.9565 -49.8647 -50.1147
quadrupole: 1.0325 0.0057 -0.0027
quadrupole: 11.3554 -5.5527 -5.8027 1.0325 0.0057 -0.0027
hfenergy: -383.3612411 hartree
pointgroup: C01 [X(C6H8O2)]
dipole: 0.6745132 0.5768424 0.1458896 debye
dipolederiv: -2.0389211 0.4451531 0.1524974 0.1794023 -0.5206406 -0.0917591 0.0800835 -0.0963939 -0.2197517 -0.6780061 -0.106483 -0.022873 0.1198484 -0.9778882 -0.1783314 0.0380973 -0.1737256 -0.3751956 0.7140992 0.0871002 0.0097939 -0.0579994 0.1016556 0.0656579 -0.0292909 0.0631163 -0.1199613 -0.9606848 -0.1549153 -0.0294178 0.006369 0.0029682 0.057091 0.0139327 0.0597908 -0.1933489 -0.3847668 -0.0977169 -0.0193389 0.02056 0.0450638 -0.0021452 0.0113485 -0.0001769 0.0507952 2.2478314 -0.1858722 -0.0833774 -0.4353816 1.2769885 0.2767327 -0.1503358 0.2715567 0.3595071 1.170269 -0.1333011 -0.0577036 0.4686377 0.1044187 0.0284236 0.1054826 0.0388244 -0.0208939 -0.3970446 0.1445761 0.0374169 0.1024331 -0.020307 0.118198 0.0256322 0.1176868 -0.4320768 0.0833604 -0.03209 -0.0074748 -0.0252117 -0.0497225 -0.0548593 -0.0055486 -0.0548137 0.140374 0.072634 -0.0036959 0.000826 -0.0335463 -0.0388062 -0.0593129 -0.0071447 -0.059811 0.167074 0.0651428 0.0653638 0.0182984 -0.0389465 -0.1173937 -0.0614249 -0.0094145 -0.0631304 0.0973865 0.0076714 -0.0085309 0.0933023 -0.0946454 0.1045042 -0.0325097 0.1167668 -0.0134196 -0.0501542 0.000728 0.0409214 -0.0853833 -0.0214092 0.0460983 0.088093 -0.1484458 0.0666884 0.0152612 0.0525267 0.0353117 0.0123125 -0.1106916 0.0147628 -0.0488392 -0.02717 -0.0513967 0.1883588 -0.0558013 -0.0598891 -0.0115081 -0.0568239 0.0635642 -0.0346914 -0.0104451 -0.0346595 0.1863398 0.1009618 -0.0359319 -0.0073705 -0.0225948 -0.0352663 -0.0703233 -0.003548 -0.0701361 0.2062858 unknown
polarizability: 144.2827758|-11.4249995|64.1829524|-4.9463959|7.9224774|37.8729289 unknown
InChI: InChI=1S/C6H8O2/c1-3-5-6(7)8-4-2/h3-5H,2H2,1H3
charge 0 multiplicity 1
16 atoms
O  -1.158569 0.436784 0.163409
O  -0.135513 -1.605793 -0.405542
C  2.432296 -0.185323 -0.0639
C  1.205371 0.384196 0.109614
C  3.747955 0.522081 0.105704
C  -0.027108 -0.400518 -0.082041
C  -2.446315 -0.140456 0.030537
C  -3.546125 0.610702 0.254424
H  2.46161 -1.247388 -0.35117
H  1.082383 1.433675 0.39486
H  3.619856 1.579723 0.391199
H  4.336183 0.480035 -0.831927
H  4.362106 0.021193 0.87959
H  -2.447642 -1.198082 -0.256366
H  -4.537131 0.161443 0.151598
H  -3.477458 1.664627 0.539211
