program: Gaussian 09
title: 000061760
version: EM64L-G09RevD.01
frameworkgroup: C1[X(C15H24N4O3S)]
method: RPBEPBE
basis: SDD
operation: Freq
keyword: #p
keyword: freq=noraman
keyword: PBEPBE/SDD
title: #p freq=noraman PBEPBE/SDD
converged: YES YES NO NO
title: Mulliken charges:
elementType: S O O O N N N N C C C C C C C C C C C C C C C H H H H H H H H H H H H H H H H H H H H H H H H
charge: 0.621006 -0.601751 -0.422710 -0.253864 -0.150393 -0.088144 -0.016247 -0.653979 -0.192932 0.351887 -0.500632 -0.600164 -0.614337 -0.332488 -0.775591 -0.321159 0.378577 -0.669087 -0.089131 0.075804 -0.418930 0.008629 -0.742977 0.275484 0.217161 0.260777 0.250498 0.271997 0.219870 0.210719 0.255018 0.268477 0.247732 0.231443 0.261186 0.193675 0.234261 0.215189 0.206635 0.186993 0.275461 0.335964 0.340091 0.330192 0.239781 0.240119 0.239887
chargesum: 0.00000
title: Mulliken charges with hydrogens summed into heavy atoms:
elementType: S O O O N N N N C C C C C C C C C C C C C C C
charge: 0.621006 -0.601751 -0.086746 -0.253864 -0.150393 -0.088144 -0.016247 0.016304 -0.192932 0.351887 -0.007987 -0.088890 -0.122470 0.133250 -0.027939 0.133702 0.378577 -0.013002 0.097862 0.075804 -0.143469 0.008629 -0.023189
polarizability: 2.91306473e+02 7.25048887e+00 2.52211748e+02 -1.79969752e+01 -1.11062526e+00 1.54008564e+02
1716.lowfreq: -10.0290 -5.1299 -0.0010 0.0006 0.0011 7.6787 18.3173 20.3176 28.0200
frequency: 18.1908 20.2338 27.4230 34.4661 48.0813 49.0687 49.4299 58.8471 82.3673 83.4844 85.8035 89.0121 103.6271 130.2418 141.2494 149.8067 164.0906 193.6888 210.4619 213.2648 225.2513 237.4491 245.9660 256.8394 283.4989 293.8614 307.1079 323.4403 338.0606 353.8836 365.5235 380.4656 390.8403 418.2952 432.2904 460.3732 464.9870 484.1200 539.2366 559.5975 575.3597 579.2917 606.7040 610.1406 647.8533 658.0222 737.5975 744.4767 757.6832 769.3035 791.5557 801.0383 818.4409 861.9464 902.5054 904.7663 924.9499 951.6774 956.7455 963.2726 965.7791 979.6367 1001.8803 1032.6462 1037.2409 1040.0595 1042.7406 1052.4138 1059.4534 1079.0195 1102.2034 1113.3010 1155.2687 1171.1374 1202.5606 1208.2763 1216.2178 1224.5347 1256.8160 1275.7595 1280.6311 1293.1116 1297.4003 1309.0488 1332.3080 1337.0427 1341.8796 1352.8366 1370.3436 1381.9454 1382.3018 1390.9854 1401.1455 1407.5353 1417.4679 1422.3967 1423.7198 1455.4875 1456.1004 1461.0006 1463.9599 1467.8370 1474.1877 1475.5828 1479.1538 1485.9011 1544.5457 1555.1417 1607.3329 1613.0807 1662.7239 2948.7026 2964.4394 2978.6731 2978.9516 2979.5006 2990.8217 2997.0658 2998.7226 3010.8173 3044.7137 3045.0352 3060.4356 3063.0858 3076.7865 3081.5165 3083.3037 3085.7392 3103.5959 3104.4425 3127.4573 3131.1832 3536.2917 3560.8931 3691.2633
redmass: 5.2011 5.5410 4.8172 4.4455 5.9539 1.5070 2.0590 4.6419 2.8349 2.2141 2.1185 3.4143 3.8600 3.4753 2.5897 1.5148 5.2602 4.0474 4.5855 4.0884 4.0385 1.2326 4.4229 2.9431 3.4229 2.6151 2.7873 1.5961 2.1852 4.2323 2.4626 2.8153 4.2911 1.5129 2.8610 3.3127 3.2481 4.5579 1.4719 5.3223 3.6208 4.2411 4.0653 4.2274 4.6904 5.0325 5.2111 4.5322 1.1309 1.7422 7.7468 5.1797 2.4710 1.2853 1.8614 3.0689 2.4342 2.0293 1.5054 1.5845 3.9702 1.6119 5.5450 1.6984 1.5103 1.4972 2.4176 1.6217 1.9650 2.1587 2.2208 3.1812 1.3438 2.3317 2.4222 1.4084 1.3673 4.1590 4.2919 3.6078 1.1856 1.1617 1.1734 2.2325 1.3860 1.3243 1.4244 1.2659 1.1624 1.4417 1.4434 1.1960 1.3205 2.1554 1.1512 1.1238 3.0609 1.0575 1.0518 1.1419 1.0763 1.1941 1.0763 1.0443 1.0425 1.0868 4.0449 5.6264 5.9194 1.3869 8.1598 1.0869 1.0665 1.0404 1.0360 1.0549 1.0599 1.0613 1.0377 1.0549 1.1013 1.1007 1.0971 1.1007 1.1018 1.0962 1.0993 1.0996 1.0981 1.1096 1.0933 1.1003 1.0447 1.0664 1.1045
irintensity: 1.9551 1.1105 0.3116 0.5236 2.3290 1.0168 0.3886 0.4365 2.8864 6.3986 1.4458 4.3147 0.6151 0.4439 1.6560 1.6196 5.8417 10.2244 3.5566 1.8508 0.5492 0.3585 7.0554 9.6656 2.9280 5.5546 13.0862 59.0618 81.3285 6.4391 0.9829 42.9383 34.1024 153.6911 21.8188 22.2454 7.3122 6.0035 57.6851 5.3714 6.1288 4.6255 5.9448 1.8678 2.8301 1.4215 3.8951 12.9662 6.6284 10.8996 56.6937 14.4983 6.5115 0.3482 12.8517 2.9258 50.9186 24.2952 4.3580 4.7110 79.2154 14.8622 102.4868 15.6584 7.1786 9.7682 4.6123 11.6583 15.1051 18.3212 21.0516 16.1375 47.9046 41.5375 39.8807 20.8735 6.1601 53.4832 1.4983 3.8909 4.1862 13.9801 18.3551 49.3418 3.3830 8.5399 25.5013 41.3236 22.2450 5.9316 6.3806 9.5516 21.0947 27.6056 38.8553 18.0448 229.2020 16.1040 12.4203 12.2099 8.0879 30.4649 4.7333 5.9591 14.8513 16.4989 119.6640 141.9756 295.5369 327.2369 3.8197 56.6015 42.6121 1.4033 28.1634 42.7802 11.9125 24.0313 9.0132 23.6910 1.5185 2.5911 6.5825 3.5882 31.0948 11.9009 43.0562 16.1147 7.6531 22.4589 7.9645 10.0750 58.9408 12.4227 47.3801
temp: 298.150 k
press: 1.00000 atm
elementType: 16 8 8 8 7 7 7 7 6 6 6 6 6 6 6 6 6 6 6 6 6 6 6 1 1 1 1 1 1 1 1 1 1 1 1 1 1 1 1 1 1 1 1 1 1 1 1
symmnumber: 1
zpe: 993389.6 jmol-1
zpe.correction: 0.378362 hartree
zpe.thermalcorrener: 0.405801 hartree
zpe.thermalcorrenthalpy: 0.406745 hartree
zpe.thermalcorrgfe: 0.317023 hartree
zpe.sumelectzpe: -1426.863589 hartree
zpe.sumelectthermal: -1426.836149 hartree
zpe.sumelectthermalent: -1426.835205 hartree
zpe.sumelectthermalfe: -1426.924928 hartree
dipole: -0.4202 5.3414 -0.0230
dipole: 5.3579
quadrupole: -194.8428 -150.7762 -138.9801
quadrupole: 2.9409 4.8511 1.3038
quadrupole: -33.3098 10.7568 22.5529 2.9409 4.8511 1.3038
hfenergy: -1427.2419507 hartree
pointgroup: C01 [X(C15H24N4O3S1)]
dipole: -0.2998734 2.0863783 -0.0255019 debye
polarizability: 289.6467448|9.4568767|253.2422785|-20.0315727|-3.4010702|154.637761 unknown
InChI: InChI=1S/C15H24N4O3S/c1-4-7-23(22)14(5-6-20)11(2)19(10-21)9-13-8-17-12(3)18-15(13)16/h8,10,20H,4-7,9,16H2,1-3H3
charge 0 multiplicity 1
47 atoms
S  3.19811 0.938369 0.949359
O  4.626725 0.687688 0.110506
O  3.973484 -3.192878 -1.506562
O  -0.998889 -3.786325 0.576993
N  -0.081437 -1.641061 0.305958
N  -3.433162 1.5813 -0.325024
N  -4.578031 -0.518126 0.117434
N  -1.180531 1.690061 -0.900175
C  2.003444 -0.407401 0.222513
C  0.81002 -0.620703 0.847016
C  2.630137 -1.170777 -0.909192
C  2.416395 2.458623 -0.013643
C  -0.968353 -1.340894 -0.860606
C  3.395019 3.633708 0.05443
C  0.286936 0.117893 2.063156
C  3.430794 -2.408632 -0.397313
C  -2.208008 -0.531733 -0.52438
C  2.93062 4.807783 -0.839554
C  -0.201159 -2.876521 0.935728
C  -2.268774 0.898142 -0.584596
C  -3.412231 -1.174156 -0.162872
C  -4.536137 0.851763 0.013199
C  -5.816538 1.599548 0.285439
H  3.358637 -0.523746 -1.437651
H  1.854611 -1.50954 -1.622062
H  2.286616 2.087594 -1.046054
H  1.442737 2.651581 0.469753
H  -1.278919 -2.325936 -1.252763
H  -0.359785 -0.841082 -1.637661
H  3.501588 3.979252 1.100942
H  4.389651 3.278381 -0.276472
H  -0.571295 0.76215 1.794232
H  -0.081614 -0.605649 2.813849
H  1.057338 0.744962 2.544148
H  4.311375 -2.059268 0.16384
H  2.790454 -3.031359 0.262731
H  3.650543 5.643277 -0.77925
H  2.862677 4.498992 -1.899203
H  1.94113 5.192444 -0.529303
H  0.499292 -2.986297 1.792997
H  -3.440792 -2.268748 -0.093016
H  3.233726 -3.655078 -1.976009
H  -0.257798 1.304632 -1.080516
H  -1.341913 2.692539 -0.982979
H  -5.639384 2.685026 0.268062
H  -6.575031 1.341192 -0.475864
H  -6.232275 1.299709 1.263036
