program: Gaussian 09
title: 000061746
version: EM64L-G09RevD.01
frameworkgroup: C1[X(C17H23NO2)]
method: RPBEPBE
basis: SDD
operation: Freq
keyword: #p
keyword: freq=noraman
keyword: PBEPBE/SDD
title: #p freq=noraman PBEPBE/SDD
converged: YES YES NO NO
title: Mulliken charges:
elementType: O O N C C C C C C C C C C C C C C C C C H H H H H H H H H H H H H H H H H H H H H H H
charge: -0.336105 -0.341146 -0.684004 -0.062367 0.383998 -0.474027 -0.486665 -0.524845 0.432085 -0.410273 -0.770381 -0.768069 -0.825405 0.272108 0.060587 0.317745 -0.312919 -0.398616 -0.271111 -0.195748 0.201173 0.229350 0.207887 0.217183 0.237371 0.207722 0.207289 0.205329 0.239463 0.214295 0.261092 0.212787 0.262037 0.228542 0.217564 0.226819 0.219165 0.259114 0.217055 0.228180 0.223496 0.373733 0.298511
chargesum: 0.00000
title: Mulliken charges with hydrogens summed into heavy atoms:
elementType: O O N C C C C C C C C C C C C C C C C C
charge: -0.336105 -0.341146 -0.011760 0.138806 0.383998 -0.036790 -0.032111 -0.109834 0.432085 -0.204944 -0.055531 -0.064703 -0.161857 0.272108 0.060587 0.317745 -0.053805 -0.181561 -0.042930 0.027748
polarizability: 2.52595917e+02 8.77088811e-01 2.13686215e+02 -6.62163842e+00 -2.30058695e+00 1.37418308e+02
1716.lowfreq: -9.2241 -0.0003 0.0003 0.0004 5.4242 6.7728 28.3857 32.9921 37.7533
frequency: 28.3082 32.9701 37.6302 68.4021 94.1265 109.3808 144.0574 153.8348 171.5026 187.0806 206.9817 212.8488 233.5320 237.4972 243.1859 271.2473 309.1171 312.4791 344.9554 357.0208 379.7430 410.3514 422.5431 425.2589 445.8122 461.4668 474.0247 488.5867 503.6186 525.1896 535.6630 558.6571 631.2621 665.2296 676.3844 724.8150 729.5634 757.2955 759.4919 779.7103 785.7899 799.9746 804.1692 853.6318 854.2204 882.2521 917.3224 922.9997 929.8099 944.2418 961.7821 965.0219 981.9997 998.2979 1018.4987 1027.6683 1031.4817 1044.5945 1056.1045 1059.8708 1091.5730 1130.4565 1136.2238 1145.3147 1152.6623 1170.5972 1174.3762 1200.9484 1216.3639 1232.2855 1253.3295 1274.8995 1284.7059 1293.1955 1298.7705 1310.3999 1329.6398 1330.3152 1352.7477 1372.1294 1376.1316 1388.3536 1394.8445 1402.6893 1440.5129 1451.3109 1456.5666 1461.3523 1462.3833 1465.4875 1472.1843 1473.2388 1482.8665 1486.8721 1506.0795 1531.1950 1576.7746 1611.5857 1632.6040 1701.2868 2941.8564 2955.0676 2955.6195 2961.5826 2986.9608 2991.8251 2995.6805 3003.9515 3012.2989 3024.1885 3058.0529 3074.4006 3087.7392 3090.4013 3090.7849 3116.3064 3118.1333 3121.2378 3139.3339 3156.9258 3178.5323 3398.3500 3647.6917
redmass: 3.9158 3.9711 3.5820 3.6341 3.7387 3.7814 5.4030 3.6149 1.1238 2.6461 2.2522 2.4395 1.4275 2.9769 1.4238 2.0374 2.6375 2.8230 4.3558 2.9169 2.3674 5.5659 2.3060 2.4420 3.0812 1.4407 2.5262 3.1055 3.0734 3.1175 3.8840 5.8775 3.8918 4.8967 4.4528 5.7191 1.3136 1.6494 2.8737 1.9576 5.2148 1.8610 1.2448 1.5383 5.2007 2.8450 1.6678 1.8129 1.4518 1.8525 1.3616 2.1770 1.3219 1.3280 2.3555 1.4356 1.5886 3.1739 2.2079 2.1527 1.9639 1.7883 2.3626 1.2556 1.3179 2.1808 1.0769 2.4244 1.6478 1.9333 1.5254 2.7965 2.0178 1.4727 1.4080 1.2837 1.9918 1.4403 1.9559 1.4944 1.3809 1.2967 1.2419 4.6231 2.8833 1.0596 1.0781 1.0815 1.0551 1.1334 1.0830 1.0769 2.2645 1.0517 1.0759 3.4722 6.7560 1.5013 7.1058 6.4952 1.0622 1.0418 1.0753 1.0631 1.0835 1.0390 1.0398 1.0711 1.0962 1.0965 1.1024 1.0981 1.0963 1.0916 1.0955 1.1002 1.0865 1.0990 1.0915 1.0936 1.0975 1.0559 1.0945
irintensity: 0.0101 0.1560 0.7697 1.9624 0.6205 0.0389 0.0054 0.9138 1.0219 0.0504 0.0408 1.7759 1.3655 3.8592 0.1639 2.3112 2.3824 0.9953 20.9054 2.2252 1.8533 1.2335 9.8115 15.9032 3.1457 80.2308 33.4270 16.4282 4.0535 21.8113 0.9096 0.9123 6.8741 4.1482 17.1971 8.3576 80.9271 115.0506 8.5948 4.4516 4.8837 1.3506 14.5426 3.0453 6.9913 10.8247 1.9360 6.2441 0.8685 2.7519 1.0741 8.8686 0.0833 1.4390 8.6539 3.4909 9.0724 201.8632 6.1520 236.6226 0.6921 147.5214 1.8262 7.3713 7.9272 17.1744 28.3148 8.2949 154.8695 91.5085 105.0048 186.2886 38.3694 17.8978 6.6054 1.1912 6.2929 1.0763 0.3026 24.0140 21.4177 63.8746 11.8495 2.8028 7.9272 1.9488 9.4904 6.1535 3.9530 46.1704 16.2924 8.9647 31.1077 2.7004 20.6301 230.7490 100.4311 109.2198 197.0146 1.2412 37.9619 67.8063 12.2237 38.2096 17.4256 13.0116 29.3569 36.9769 50.2445 30.8494 48.7005 24.3484 15.1638 55.1338 36.4629 3.6957 9.0487 20.1309 23.3215 20.1509 12.0243 113.9052 59.5286
temp: 298.150 k
press: 1.00000 atm
elementType: 8 8 7 6 6 6 6 6 6 6 6 6 6 6 6 6 6 6 6 6 1 1 1 1 1 1 1 1 1 1 1 1 1 1 1 1 1 1 1 1 1 1 1
symmnumber: 1
zpe: 954516.7 jmol-1
zpe.correction: 0.363556 hartree
zpe.thermalcorrener: 0.383591 hartree
zpe.thermalcorrenthalpy: 0.384535 hartree
zpe.thermalcorrgfe: 0.315100 hartree
zpe.sumelectzpe: -865.321242 hartree
zpe.sumelectthermal: -865.301207 hartree
zpe.sumelectthermalent: -865.300263 hartree
zpe.sumelectthermalfe: -865.369699 hartree
dipole: -0.1296 -0.0338 -0.2841
dipole: 0.3140
quadrupole: -100.8207 -116.3299 -122.2373
quadrupole: -1.8461 -1.4144 -0.2221
quadrupole: 12.3086 -3.2006 -9.1080 -1.8461 -1.4144 -0.2221
hfenergy: -865.6847986 hartree
pointgroup: C01 [X(C17H23N1O2)]
dipole: -0.0519857 -0.0120315 -0.1114319 debye
polarizability: 252.3384501|2.0854996|213.8378984|-7.9440496|-0.6974981|137.5240921 unknown
InChI: InChI=1S/C17H23NO2/c1-12-8-10-13(11-9-12)17(2,3)20-16(19)14-6-4-5-7-15(14)18/h4-8,13H,9-11,18H2,1-3H3
charge 0 multiplicity 1
43 atoms
O  -0.134237 -0.672234 0.017208
O  -1.912305 -2.194961 -0.000367
N  -4.386112 -1.200322 0.035046
C  2.271206 -0.922454 -0.018431
C  0.944542 -1.749514 -0.018671
C  2.408484 0.037099 -1.22859
C  2.479134 -0.122385 1.296078
C  3.814635 0.675925 -1.279091
C  4.267602 1.222037 0.068533
C  3.636002 0.857819 1.217892
C  0.819947 -2.634112 1.241191
C  0.787004 -2.590495 -1.304272
C  5.445846 2.17609 0.05221
C  -1.486079 -0.993844 0.021422
C  -2.355782 0.200321 0.05342
C  -3.793135 0.045895 0.058279
C  -1.7966 1.510857 0.078649
C  -4.602156 1.227224 0.088005
C  -2.605953 2.656096 0.108359
C  -4.019971 2.501614 0.112554
H  3.085384 -1.676416 -0.091943
H  1.640079 0.828078 -1.140347
H  2.219523 -0.494767 -2.178768
H  2.662797 -0.816369 2.139877
H  1.541837 0.418456 1.544669
H  3.824848 1.493749 -2.029043
H  4.558095 -0.067993 -1.640434
H  3.975672 1.286558 2.172534
H  0.739378 -2.02089 2.153949
H  1.718618 -3.272262 1.332426
H  -0.06999 -3.278489 1.175556
H  1.692032 -3.209074 -1.450383
H  -0.089692 -3.251613 -1.229871
H  0.661805 -1.949603 -2.192891
H  6.332384 1.70669 -0.420433
H  5.731645 2.494522 1.07012
H  5.217558 3.084406 -0.541072
H  -0.706858 1.60001 0.074229
H  -5.693798 1.119198 0.091507
H  -2.156872 3.653732 0.128085
H  -4.666342 3.38688 0.135149
H  -3.769298 -2.021769 0.014616
H  -5.39888 -1.287591 0.039044
