program: Gaussian 09
title: 000073192
version: EM64L-G09RevD.01
frameworkgroup: C1[X(C13H14O9)]
method: RPBEPBE
basis: SDD
operation: Freq
keyword: #pfreq=noraman
keyword: PBEPBE/SDD
title: #p freq=noraman PBEPBE/SDD
converged: NO YES NO NO
title: Mulliken charges:
elementType: O O O O O O O O O C C C C C C C C C C C C C H H H H H H H H H H H H H H
charge: -0.284035 -0.256218 -0.420157 -0.422299 -0.447899 -0.420855 -0.221587 -0.465064 -0.477896 -0.125951 -0.107890 -0.205334 -0.112342 -0.046440 0.299113 -0.362076 0.111466 0.109666 0.030105 -0.560910 -0.019820 0.237263 0.280394 0.239725 0.196936 0.257519 0.214864 0.238370 0.192069 0.364928 0.341261 0.278103 0.373600 0.394910 0.409562 0.386918
chargesum: 0.00000
title: Mulliken charges with hydrogens summed into heavy atoms:
elementType: O O O O O O O O O C C C C C C C C C C C C C
charge: -0.284035 -0.256218 -0.055229 -0.081038 -0.074299 -0.025946 -0.221587 -0.055502 -0.090977 0.154443 0.131835 -0.008398 0.145177 0.168423 0.299113 0.068363 0.111466 0.109666 0.030105 -0.282807 -0.019820 0.237263
polarizability: 2.32370876e+02 -1.73911489e+00 2.00803324e+02 7.85117166e+00 6.09989860e-01 9.48359391e+01
1716.lowfreq: -105.5636 -10.7610 -0.0006 -0.0004 0.0004 1.8734 4.6267 36.5265 49.2297
frequency: -105.5276 36.5218 49.2213 75.4893 84.5095 102.2544 123.6356 134.0342 156.1776 169.1716 183.2207 218.2288 241.6506 254.0143 270.2571 280.9347 289.6439 300.3727 304.8091 313.8854 338.1168 347.0841 390.7013 396.9709 417.4348 431.4921 460.1278 465.3800 487.4471 497.3018 511.8713 533.5508 543.7403 553.9542 565.4358 572.5885 587.9068 627.4511 673.2224 678.9873 720.9745 736.4679 775.9975 824.5684 866.3714 867.0343 929.0674 961.1073 966.7767 987.7684 997.3128 1011.9857 1017.2713 1032.2411 1045.1873 1078.6752 1093.6611 1097.2982 1112.1968 1118.6313 1138.7022 1172.7481 1189.1229 1193.4111 1207.5193 1226.2821 1235.9983 1252.0978 1269.1476 1269.4069 1272.1778 1285.3109 1312.5872 1331.2252 1335.1040 1347.6220 1352.8652 1357.0734 1373.1307 1386.4746 1388.5847 1420.9881 1464.7718 1493.2031 1497.8233 1611.5505 1619.6306 1649.9774 2893.6481 2907.4642 2939.0488 2962.8153 3020.6803 3057.7260 3105.5277 3149.2963 3490.1194 3492.3897 3534.9356 3553.8608 3561.3086 3624.7278
redmass: 1.0878 8.0224 7.0412 6.7309 6.6585 8.5490 5.2836 8.5040 5.7382 6.2730 3.8605 6.0450 7.9336 6.7069 5.2311 4.8022 3.1799 2.2098 6.1996 2.2477 4.4667 7.4926 7.5740 4.6752 4.5491 1.1534 1.1391 5.9445 4.1808 1.3255 4.3285 5.4923 3.7864 1.2398 3.9784 4.7130 5.2165 5.7457 6.7715 4.4815 10.1782 4.9312 5.9851 3.9808 1.6126 3.7349 5.0343 5.6087 6.1607 4.5126 5.6848 3.7728 3.0195 5.3736 3.2452 3.7838 4.0656 4.3617 2.1013 1.9123 1.8295 1.2828 1.3227 1.3882 1.2720 1.2989 1.5365 3.2521 1.4251 1.3479 1.3062 1.2090 1.3685 1.4500 1.4901 1.7143 1.2756 2.0213 1.5906 1.3602 1.3098 7.1264 1.0853 4.7782 4.3663 8.1003 8.3283 10.7607 1.0813 1.0808 1.0814 1.0714 1.0849 1.0858 1.0939 1.0922 1.0656 1.0648 1.0657 1.0654 1.0664 1.0668
irintensity: 107.9929 0.9318 1.0518 4.8973 5.5072 2.6312 3.5123 1.8948 0.4146 3.6140 1.9931 15.4405 7.5570 9.5096 1.4690 11.5636 61.2869 66.0487 9.3660 33.0385 10.8040 2.9922 0.3373 1.3247 7.8534 189.3128 189.3076 10.6587 4.4489 25.9063 15.7493 12.5233 20.8194 225.0542 7.7526 3.2162 25.7625 19.3189 23.8520 2.5750 7.0294 11.0251 25.2694 80.0263 27.9053 5.3060 129.1440 12.7626 54.3023 60.1886 114.0367 218.8640 16.0934 336.9887 117.7105 11.2927 71.7041 67.0290 12.3248 5.0541 121.4142 3.2969 0.2601 116.3957 23.2188 19.1944 96.8783 30.3308 207.2419 156.4339 13.0179 22.9127 18.5029 59.1035 50.7694 65.6327 7.6313 73.6048 74.6064 2.9507 45.8108 2.0237 4.7736 28.6151 61.9990 55.1795 222.2995 159.5723 25.7805 37.3695 23.4172 78.9413 13.7117 22.0863 16.8774 5.6364 38.2426 82.1016 16.4117 151.4255 12.3333 88.2180
temp: 298.150 k
press: 1.00000 atm
elementType: 8 8 8 8 8 8 8 8 8 6 6 6 6 6 6 6 6 6 6 6 6 6 1 1 1 1 1 1 1 1 1 1 1 1 1 1
symmnumber: 1
zpe: 692981.6 jmol-1
zpe.correction: 0.263943 hartree
zpe.thermalcorrener: 0.283896 hartree
zpe.thermalcorrenthalpy: 0.284840 hartree
zpe.thermalcorrgfe: 0.216562 hartree
zpe.sumelectzpe: -1179.110787 hartree
zpe.sumelectthermal: -1179.090834 hartree
zpe.sumelectthermalent: -1179.089890 hartree
zpe.sumelectthermalfe: -1179.158168 hartree
dipole: 6.3594 -0.1706 -0.8284
dipole: 6.4154
quadrupole: -111.2030 -151.1740 -124.6481
quadrupole: -8.8903 12.0222 -0.7944
quadrupole: 17.8054 -22.1657 4.3603 -8.8903 12.0222 -0.7944
hfenergy: -1179.3747302 hartree
pointgroup: C01 [X(C13H14O9)]
dipole: -2.4996833 -0.1514076 0.3151319 debye
polarizability: 232.1246121|2.962268|200.9393906|8.5318835|-1.6955918|94.9461362 unknown
InChI: InChI=1S/C13H14O9/c14-2-5-8(17)10(19)12-11(21-5)6-3(13(20)22-12)1-4(15)7(16)9(6)18/h1,5,8,10-12,14-19H,2H2
charge 0 multiplicity 1
36 atoms
O  1.315789 -1.124912 -0.185625
O  0.438981 2.47504 0.256513
O  3.173875 2.613171 -0.581304
O  4.835757 0.23785 0.075995
O  2.564134 -3.532429 0.165555
O  -0.995704 -2.557605 0.44827
O  -1.594726 3.527218 0.247948
O  -3.651448 -2.56239 -0.045797
O  -5.089465 -0.288113 -0.466232
C  1.146164 1.252926 -0.212876
C  0.590358 -0.019757 0.444437
C  2.634865 1.447645 0.107929
C  3.4305 0.198617 -0.337199
C  2.753674 -1.091427 0.200263
C  -0.898887 -0.112326 0.198932
C  3.30702 -2.396424 -0.379133
C  -1.623394 1.106738 0.018011
C  -0.973605 2.447839 0.160522
C  -1.614378 -1.332332 0.197863
C  -3.02492 1.109901 -0.201261
C  -3.010366 -1.320341 -0.044124
C  -3.709014 -0.111375 -0.249409
H  1.007783 1.171958 -1.309147
H  0.805153 -0.012434 1.539135
H  2.73133 1.56967 1.215911
H  3.466022 0.17546 -1.440836
H  2.822307 -1.120275 1.31191
H  4.359691 -2.530884 -0.087981
H  3.236198 -2.361379 -1.487793
H  2.581358 3.384739 -0.38027
H  4.910095 0.66507 0.966978
H  -3.533826 2.074045 -0.307795
H  1.596947 -3.308517 0.084288
H  -1.685412 -3.274841 0.407651
H  -4.621075 -2.444302 -0.219641
H  -5.560583 0.568471 -0.601387
