program: Gaussian 09
title: 000061665
version: EM64L-G09RevD.01
frameworkgroup: C1[X(C10H16O)]
method: RPBEPBE
basis: SDD
operation: Freq
keyword: #pfreq=noraman
keyword: PBEPBE/SDD
title: #p freq=noraman PBEPBE/SDD
converged: YES YES NO NO
title: Mulliken charges:
elementType: O C C C C C C C C C C H H H H H H H H H H H H H H H H
charge: -0.325459 0.331213 -0.510473 -0.517047 -0.159083 -0.735194 0.571568 -0.137705 -0.814279 -0.763957 -0.567505 0.225981 0.239624 0.243605 0.224536 0.210102 0.243828 0.219717 0.206599 0.217636 0.211412 0.259000 0.223160 0.222521 0.222187 0.208881 0.249134
chargesum: 0.00000
title: Mulliken charges with hydrogens summed into heavy atoms:
elementType: O C C C C C C C C C C
charge: -0.325459 0.331213 -0.044868 -0.048906 0.051019 -0.065051 0.571568 0.079930 -0.120707 -0.319250 -0.109490
polarizability: 1.27192868e+02 7.68467672e+00 1.11140402e+02 2.17100090e+00 1.83031589e+00 8.77072866e+01
1716.lowfreq: -2.8287 -0.0004 0.0005 0.0006 5.5318 23.5378 36.0405 56.8455 95.8807
frequency: 35.2378 56.6809 95.7085 136.0681 146.9057 169.7447 238.8544 260.6106 282.9117 292.7133 332.6948 355.4777 397.5129 491.6941 505.2526 531.5642 560.7818 604.2093 683.1551 700.2640 743.6107 802.3849 849.4392 867.5441 908.2184 922.7196 947.2530 956.3263 961.0097 982.9260 994.6092 1000.1272 1004.3784 1023.8530 1036.9713 1052.6575 1111.3155 1143.2735 1171.9449 1203.7250 1214.6580 1275.9333 1284.6870 1294.2491 1306.6973 1309.0299 1334.6355 1381.3293 1389.6464 1401.4576 1432.5010 1456.4957 1460.2338 1465.5484 1472.1587 1475.0011 1481.7442 1653.4573 1667.8273 2955.8279 2976.6784 2982.2715 3009.3743 3017.8277 3057.8655 3073.1649 3074.5106 3079.6856 3087.7486 3089.7003 3096.0249 3097.6360 3104.1067 3190.9895 3213.0743
redmass: 3.5382 2.7464 2.6486 2.7472 2.2955 1.1753 1.0648 2.7173 2.6689 2.1495 2.1232 2.5254 2.8637 2.6741 2.8994 2.6984 2.3708 3.1920 1.7614 1.3016 2.5789 3.0861 2.4964 2.1340 2.1590 1.7387 1.3296 1.3791 1.7791 1.7741 1.6129 1.1352 2.2279 1.4628 1.7617 1.5021 2.1796 1.7647 2.3281 1.8606 2.0373 1.2913 1.3133 1.3445 2.2955 1.3906 1.4654 1.2146 1.2466 1.1939 1.1924 1.0634 1.0549 1.0687 1.0863 1.0685 1.0623 5.2857 4.9953 1.0854 1.0385 1.0353 1.0597 1.0622 1.0935 1.1024 1.0841 1.0940 1.0629 1.1044 1.0999 1.0999 1.0726 1.1137 1.1151
irintensity: 0.6324 0.8482 0.3411 0.3738 0.9639 0.4835 0.3266 1.8265 2.1486 2.5904 0.3355 0.3955 2.9966 1.1208 1.8296 5.6812 2.3239 0.9980 14.2346 1.3636 5.7425 2.8733 26.4350 16.3439 12.9154 1.1928 81.4162 50.1288 1.3626 52.9081 50.3149 46.8574 25.9628 6.9287 4.5315 3.3984 20.0324 18.4701 8.2568 14.2222 11.4156 8.8687 0.4920 0.9125 2.5523 6.6365 5.6793 18.2451 32.0401 14.5200 1.2614 7.8121 3.1988 20.3691 11.4156 11.4393 25.0531 10.1580 18.3624 41.8852 18.0422 24.5243 26.8952 22.2807 23.1804 14.1649 2.8942 59.2939 8.5478 42.0418 20.9689 26.6232 16.7330 23.8897 15.3423
temp: 298.150 k
press: 1.00000 atm
elementType: 8 6 6 6 6 6 6 6 6 6 6 1 1 1 1 1 1 1 1 1 1 1 1 1 1 1 1
symmnumber: 1
zpe: 612644.2 jmol-1
zpe.correction: 0.233344 hartree
zpe.thermalcorrener: 0.245662 hartree
zpe.thermalcorrenthalpy: 0.246606 hartree
zpe.thermalcorrgfe: 0.194915 hartree
zpe.sumelectzpe: -464.968211 hartree
zpe.sumelectthermal: -464.955893 hartree
zpe.sumelectthermalent: -464.954948 hartree
zpe.sumelectthermalfe: -465.006639 hartree
dipole: -0.2367 -1.5613 1.4670
dipole: 2.1554
quadrupole: -65.0229 -66.8780 -68.7317
quadrupole: 1.0514 -1.6735 1.3509
quadrupole: 1.8546 -0.0004 -1.8542 1.0514 -1.6735 1.3509
hfenergy: -465.2015544 hartree
pointgroup: C01 [X(C10H16O1)]
dipole: -0.0674399 0.843624 -0.0533711 debye
polarizability: 127.1282165|-5.5493288|100.0804889|-5.6988907|11.9383954|98.8318515 unknown
InChI: InChI=1S/C10H16O/c1-5-10(4)7-6-9(11-10)8(2)3/h5,9H,1-2,6-7H2,3-4H3
charge 0 multiplicity 1
27 atoms
O  -0.190835 -0.621314 0.178662
C  -1.383655 0.277523 0.274864
C  -0.975176 1.576316 -0.499302
C  0.569049 1.573546 -0.430539
C  0.901043 0.065931 -0.570095
C  -1.633733 0.547454 1.777811
C  2.247284 -0.377309 -0.017579
C  -2.59368 -0.398505 -0.35253
C  2.446718 -0.2880 1.482803
C  3.211396 -0.828459 -0.862647
C  -2.600821 -1.638937 -0.895913
H  -1.426336 2.478646 -0.05176
H  -1.308869 1.505953 -1.550611
H  1.036426 2.172749 -1.22984
H  0.919436 1.959312 0.543628
H  0.830516 -0.224769 -1.639952
H  -1.706169 -0.411831 2.317768
H  -0.801916 1.131225 2.21161
H  -2.575623 1.106408 1.930515
H  -3.515068 0.204941 -0.335134
H  2.37841 0.756849 1.843711
H  1.655551 -0.859934 1.999777
H  3.431009 -0.687199 1.780047
H  4.20212 -1.125513 -0.500235
H  3.035573 -0.914953 -1.942034
H  -3.51024 -2.066053 -1.333547
H  -1.688109 -2.243776 -0.901179
