program: Gaussian 09
title: 000073098
version: EM64L-G09RevD.01
frameworkgroup: C1[X(C5H6N2OS)]
method: RPBEPBE
basis: SDD
operation: Freq
keyword: #p
keyword: freq=noraman
keyword: PBEPBE/SDD
title: #p freq=noraman PBEPBE/SDD
converged: YES YES NO NO
title: Mulliken charges:
elementType: S O N N C C C C C H H H H H H
charge: 0.335355 -0.272303 -0.387714 -0.499929 -0.260550 -0.216250 0.256461 -0.134791 -0.511612 0.234175 0.249248 0.268908 0.324735 0.306971 0.307296
chargesum: 0.00000
title: Mulliken charges with hydrogens summed into heavy atoms:
elementType: S O N N C C C C C
charge: 0.335355 -0.272303 -0.062980 0.114338 -0.260550 0.017925 0.256461 0.114457 -0.242704
polarizability: 1.25730466e+02 3.38178133e+00 9.17326953e+01 -1.27255285e-01 1.54488091e-01 3.80830170e+01
1716.lowfreq: -24.2392 -6.0628 0.0009 0.0018 0.0020 3.2520 11.4269 110.7385 134.4889
frequency: -23.1272 110.7384 134.4876 142.1977 211.8029 270.6067 339.9627 432.9589 437.9518 500.2678 567.6271 631.8377 698.2918 713.0096 716.8277 777.4045 797.6372 828.5928 834.9796 909.8607 993.9277 1066.2109 1093.2929 1195.7176 1222.5115 1282.7664 1286.0547 1339.6572 1437.0805 1459.2993 1525.7030 1587.6114 1681.3879 3158.0255 3185.6803 3235.3847 3385.7792 3499.9149 3566.0190
redmass: 4.3726 4.0710 1.2096 5.3178 4.0024 6.5227 5.2701 6.7311 6.2755 1.3270 2.4159 9.5808 6.8230 1.2441 4.4090 1.6513 6.6393 1.3955 5.6267 1.3748 4.1753 1.7139 1.1349 4.8965 1.4936 2.2578 1.1630 2.3484 1.8167 5.7673 5.8198 7.4265 1.0607 1.0921 1.0956 1.1001 1.0427 1.0987 1.0792
irintensity: 1.0436 0.2688 23.0337 0.5481 3.7742 22.7371 11.2845 3.7715 3.7821 134.6492 28.3123 0.6360 0.8840 142.1269 0.4085 111.6118 60.7970 13.3545 4.2011 0.3967 1.3262 18.5939 0.5657 6.3463 3.6639 112.1435 1.5134 8.5844 108.9481 106.5681 51.3353 138.7069 32.2776 7.1086 5.1755 0.6888 0.6903 2.0110 26.5290
temp: 298.150 k
press: 1.00000 atm
elementType: 16 8 7 7 6 6 6 6 6 1 1 1 1 1 1
symmnumber: 1
zpe: 282672.0 jmol-1
zpe.correction: 0.107664 hartree
zpe.thermalcorrener: 0.115873 hartree
zpe.thermalcorrenthalpy: 0.116817 hartree
zpe.thermalcorrgfe: 0.074294 hartree
zpe.sumelectzpe: -776.217147 hartree
zpe.sumelectthermal: -776.208938 hartree
zpe.sumelectthermalent: -776.207994 hartree
zpe.sumelectthermalfe: -776.250517 hartree
dipole: 1.3686 3.1436 -0.0348
dipole: 3.4288
quadrupole: -50.9158 -60.5355 -61.2593
quadrupole: 0.7084 -0.0686 0.1749
quadrupole: 6.6544 -2.9653 -3.6891 0.7084 -0.0686 0.1749
hfenergy: -776.3248111 hartree
pointgroup: C01 [X(C5H6N2O1S1)]
dipole: 0.7083336 1.1480156 -0.0113251 debye
dipolederiv: 0.1162659 -0.0611139 -0.0009792 0.0145251 -0.1969597 -0.0042866 0.00193 -0.004613 0.1758195 -0.7736809 -0.2199649 0.003752 -0.0640544 -0.8523806 0.010236 -0.0039723 0.0075971 -0.3636543 -0.4130108 0.2538429 -0.0079988 0.6067859 -0.5167692 -0.0065841 -0.0125868 -0.0083766 -0.4708055 -0.1973644 0.1336554 -0.0022291 0.2500375 -0.3997281 0.010187 -0.006689 0.0102004 -0.0373174 -0.6694466 -0.1713483 -0.0015202 -0.3832369 0.2700936 0.0099305 -0.0023438 0.0078804 -0.1661575 0.174124 -0.1329417 -0.0029357 0.0833943 -0.1477843 0.0005465 -0.0039221 0.0020272 -0.1452195 1.5544142 -0.0899639 0.0021432 -0.2508568 1.173876 -0.0200068 0.0107151 -0.0154948 0.2661717 -0.1545917 0.1385349 0.0017929 0.202547 -0.1706297 -0.0009035 0.0033877 -0.0003047 -0.1485 -0.104757 0.1909543 0.0021024 -0.0164462 0.2341225 0.0066841 -0.0000568 0.0053138 -0.3088389 0.0821684 0.0810191 0.0011062 0.098083 -0.0394648 -0.0037324 0.0019284 -0.0033416 0.1931044 0.0161141 -0.0751632 -0.0003472 -0.1145446 0.0080647 -0.0021423 -0.0007835 -0.0022483 0.1990131 0.0014357 0.0338227 0.0009146 0.0122995 0.0846852 -0.0017485 -0.0002465 -0.0016057 0.2179651 0.0801221 -0.0663965 0.0028723 -0.1036306 0.152201 0.0059064 0.0026078 0.0074056 0.3548941 0.1431472 -0.0088061 -0.030024 -0.1683866 0.2071821 0.1472965 -0.0414809 0.0887465 0.1098108 0.1450596 -0.0061308 0.0313505 -0.1665161 0.1934912 -0.1513829 0.0515128 -0.0931863 0.1237144 unknown
polarizability: 125.9960322|-1.5243199|91.4654502|-0.2041012|0.318936|38.0846957 unknown
InChI: InChI=1S/C5H6N2OS/c6-7-5(8)4-2-1-3-9-4/h1-3,7H,6H2
charge 0 multiplicity 1
15 atoms
S  1.335752 -1.394731 -0.018203
O  -1.703518 -1.30083 0.024964
N  -1.970534 1.008946 -0.01016
N  -3.388981 0.9476 -0.006861
C  0.286034 0.075411 0.003563
C  1.054585 1.239226 0.014431
C  -1.180309 -0.141144 0.008621
C  2.472159 0.996059 0.006916
C  2.788534 -0.356483 -0.009379
H  0.634466 2.249289 0.031999
H  3.223133 1.789367 0.014794
H  3.772798 -0.822078 -0.017314
H  -1.574498 1.947952 -0.041231
H  -3.72273 0.485049 0.851687
H  -3.724689 0.435968 -0.836426
