program: Gaussian 09
title: 000061657
version: EM64L-G09RevD.01
frameworkgroup: C1[X(C6H8OS)]
method: RPBEPBE
basis: SDD
operation: Freq
keyword: #pfreq=noraman
keyword: PBEPBE/SDD
title: #p freq=noraman PBEPBE/SDD
converged: YES YES NO NO
title: Mulliken charges:
elementType: S O C C C C C C H H H H H H H H
charge: 0.230451 -0.219831 0.348883 -0.161235 -0.390663 -0.238262 -0.776855 -0.827836 0.255507 0.266338 0.241096 0.245236 0.235391 0.265280 0.275133 0.251367
chargesum: 0.00000
title: Mulliken charges with hydrogens summed into heavy atoms:
elementType: S O C C C C C C
charge: 0.230451 -0.219831 0.348883 -0.161235 -0.135155 0.028077 -0.055132 -0.036056
polarizability: 1.16521525e+02 4.63305503e+00 7.91036331e+01 1.77854060e-01 7.47347159e-01 5.42159137e+01
1716.lowfreq: -9.6339 -4.4731 -3.5730 -0.0025 -0.0017 0.0023 45.3073 101.5582 117.5689
frequency: 45.2982 101.5530 117.5686 120.6595 196.3466 234.1329 311.7906 373.1034 440.8468 610.1544 614.6885 627.9313 654.1474 805.7013 865.1150 885.6287 916.4730 961.2658 965.0668 986.9166 1014.5903 1047.2353 1065.0411 1188.3922 1213.7666 1322.9235 1332.7393 1403.9061 1442.8181 1455.8367 1458.5060 1470.0244 1501.8009 1596.8560 2983.8835 3015.2528 3061.2042 3102.6649 3140.9209 3147.7363 3219.6827 3241.4037
redmass: 3.3630 1.9267 1.4218 1.0332 3.9686 3.8483 4.2662 3.3504 8.9516 3.6602 5.7120 6.4990 4.6272 1.2015 1.3650 5.5925 5.7278 1.2236 1.8088 1.2839 1.5656 1.4630 3.1393 1.3830 5.3980 2.8155 1.1753 1.2416 1.0574 1.0436 1.0554 1.1166 6.5501 6.0884 1.0374 1.0275 1.0983 1.0979 1.1042 1.1066 1.0946 1.1035
irintensity: 2.5619 1.7812 1.9293 0.1358 4.3016 2.6101 0.4763 2.0157 0.6323 0.8880 2.4903 0.2214 0.6758 71.2936 0.7891 10.7255 7.2530 4.2349 4.5476 22.8259 28.3364 6.7391 41.4149 12.0702 9.2025 1.4197 0.8268 6.6760 17.7014 15.4368 13.5531 19.3668 12.2440 23.6483 30.0645 27.7703 16.2803 13.6889 12.6745 13.1705 6.0923 0.2199
temp: 298.150 k
press: 1.00000 atm
elementType: 16 8 6 6 6 6 6 6 1 1 1 1 1 1 1 1
symmnumber: 1
zpe: 324556.3 jmol-1
zpe.correction: 0.123617 hartree
zpe.thermalcorrener: 0.132653 hartree
zpe.thermalcorrenthalpy: 0.133597 hartree
zpe.thermalcorrgfe: 0.088748 hartree
zpe.sumelectzpe: -706.085127 hartree
zpe.sumelectthermal: -706.076090 hartree
zpe.sumelectthermalent: -706.075146 hartree
zpe.sumelectthermalfe: -706.119996 hartree
dipole: 1.2411 -0.3780 1.7620
dipole: 2.1881
quadrupole: -46.3792 -52.3336 -57.3351
quadrupole: 1.5626 -2.6558 0.0443
quadrupole: 5.6368 -0.3177 -5.3191 1.5626 -2.6558 0.0443
hfenergy: -706.2087435 hartree
pointgroup: C01 [X(C6H8O1S1)]
dipole: -0.4487882 0.2140985 0.7027296 debye
dipolederiv: 0.0250498 0.0199048 -0.0880096 -0.0893043 -0.0914105 0.1111725 -0.0039844 0.1019395 0.0604593 -0.6461544 0.0212465 0.1272268 0.0754911 -0.5657667 0.1472368 0.1647477 0.1693009 -0.1905347 0.3287551 -0.0885405 -0.0892169 -0.1135601 0.4047615 -0.1512115 -0.0305291 -0.1265122 0.05376 0.4563343 0.0165356 -0.107751 -0.1707864 0.259741 -0.2011612 0.0123507 -0.1644329 -0.0999566 -0.1564169 0.037105 -0.0650402 0.1479893 -0.2012553 -0.0053109 -0.0767957 -0.0186875 -0.2129002 -0.0208912 -0.0996102 0.0196802 -0.0144493 -0.0605012 -0.0227358 -0.0657401 -0.0323557 -0.1615746 -0.0391873 0.0319622 0.0198956 0.1223344 -0.028551 0.0168012 -0.0162718 0.0321794 0.0834541 -0.0684558 0.0600063 0.1207352 0.0787494 0.0793975 0.0392559 0.0471842 -0.0020554 0.0660657 -0.026025 -0.0653262 0.065306 -0.0530812 0.1012563 0.045437 0.0671036 0.0455703 0.1739241 0.0927175 0.0765812 -0.0015791 0.0776208 0.027476 0.0481361 0.0043347 0.0482817 0.1689387 0.0486384 -0.0196311 -0.0503086 0.049267 -0.0741396 -0.09014 -0.0033436 -0.116775 0.0461162 0.0459867 0.050787 -0.0059338 0.0671427 0.0607661 0.0549285 -0.0701198 0.090037 -0.0905631 -0.07722 -0.0304835 0.0507661 -0.0972848 0.0490745 0.0462086 0.0738508 0.0327691 0.0977176 0.1043534 -0.0332285 0.0031224 -0.0404291 0.0190145 0.029955 -0.0676207 0.0129671 -0.1330045 0.0703193 0.0896222 -0.0316913 0.0469888 -0.0770804 -0.0468483 -0.0368392 -0.0495313 0.0475912 -0.1378038 -0.0669306 0.0327983 -0.0866885 0.0972175 -0.0217238 0.0016728 -0.022695 0.0905069 unknown
polarizability: 116.6614506|2.9301733|78.5805355|-3.3709865|-2.4872488|54.5990853 unknown
InChI: InChI=1S/C6H8OS/c1-5-3-4-6(7-5)8-2/h3-4H,1-2H3
charge 0 multiplicity 1
16 atoms
S  2.314548 -0.171649 -0.833451
O  -0.269641 0.773111 -0.516275
C  -1.552436 0.358168 -0.090632
C  0.608938 -0.329649 -0.313482
C  -1.48498 -0.957472 0.345454
C  -0.11048 -1.392756 0.209376
C  -2.647696 1.36921 -0.193405
C  2.970264 1.025922 0.489751
H  -2.318626 -1.54606 0.723796
H  0.301663 -2.365391 0.468094
H  -2.433037 2.263327 0.420773
H  -2.786973 1.708586 -1.236287
H  -3.596302 0.930457 0.157106
H  2.885951 0.562606 1.483746
H  2.403371 1.966739 0.442939
H  4.026834 1.206551 0.236897
