program: Gaussian 09
title: 000061633
version: EM64L-G09RevD.01
frameworkgroup: C1[X(C7H10O2)]
method: RPBEPBE
basis: SDD
operation: Freq
keyword: #pfreq=noraman
keyword: PBEPBE/SDD
title: #p freq=noraman PBEPBE/SDD
converged: YES YES NO NO
title: Mulliken charges:
elementType: O O C C C C C C C H H H H H H H H H H
charge: -0.135910 -0.130798 -0.067477 -0.146368 -0.533780 0.058163 0.070475 -0.715765 -0.713707 0.231061 0.238177 0.262299 0.240434 0.208272 0.225540 0.224748 0.246985 0.219143 0.218507
chargesum: 0.00000
title: Mulliken charges with hydrogens summed into heavy atoms:
elementType: O O C C C C C C C
charge: -0.135910 -0.130798 0.163584 0.091809 -0.031048 0.058163 0.070475 -0.057205 -0.029072
polarizability: 8.89695978e+01 -9.27761271e-01 8.22776726e+01 -1.43967532e+00 -1.71916655e-01 5.58552554e+01
1716.lowfreq: -9.4903 -5.4110 0.0011 0.0012 0.0015 13.1473 60.5110 102.8503 176.6362
frequency: 60.4733 102.8457 176.5908 209.4743 227.1427 264.9321 281.5232 309.1523 368.8454 453.1727 491.9553 521.5771 572.1605 661.0608 728.2389 807.7298 876.0742 918.1929 965.6901 974.7169 1014.1279 1054.4686 1083.1582 1103.5275 1155.8393 1162.1566 1185.9675 1234.2555 1252.6306 1269.6388 1306.7425 1341.0394 1388.2688 1394.2850 1424.3356 1471.0328 1474.2246 1475.9655 1481.3386 1646.7235 1672.3838 2918.4462 2966.2048 2973.1472 2982.8688 2990.4091 3067.5138 3074.9687 3076.2120 3086.4469 3095.4181
redmass: 5.4916 2.7733 1.0666 1.2364 1.9822 2.6194 2.8455 10.5939 4.0424 2.5445 5.5609 3.9840 3.4207 4.8675 2.8435 2.2223 1.6492 2.0749 1.2809 2.6394 1.3941 3.4652 1.9396 2.1561 2.1265 2.8066 1.6801 1.4780 1.4121 1.5335 1.5938 1.5208 1.2101 1.2001 1.0836 1.0507 1.0498 1.0452 1.0454 12.4153 12.3595 1.0793 1.0700 1.0377 1.0803 1.0360 1.0986 1.0946 1.0991 1.0996 1.0999
irintensity: 0.0497 4.2564 0.3582 1.0455 0.9346 1.2944 1.6313 4.3686 3.7766 0.0053 0.9411 3.0785 8.4630 4.2585 2.3531 0.2984 3.8405 3.9360 15.8721 35.6913 1.2781 28.4716 15.3355 0.8395 6.9477 36.7600 4.4573 3.0199 5.2398 13.2375 6.9037 9.8228 19.7312 10.8003 22.4892 6.2827 15.7221 14.8187 12.4163 194.4489 28.7014 10.0565 3.3705 23.9926 27.5447 25.5574 30.4166 26.8954 23.5046 31.7737 17.0020
temp: 298.150 k
press: 1.00000 atm
elementType: 8 8 6 6 6 6 6 6 6 1 1 1 1 1 1 1 1 1 1
symmnumber: 1
zpe: 405505.9 jmol-1
zpe.correction: 0.154449 hartree
zpe.thermalcorrener: 0.163806 hartree
zpe.thermalcorrenthalpy: 0.164750 hartree
zpe.thermalcorrgfe: 0.120175 hartree
zpe.sumelectzpe: -422.480752 hartree
zpe.sumelectthermal: -422.471395 hartree
zpe.sumelectthermalent: -422.470451 hartree
zpe.sumelectthermalfe: -422.515026 hartree
dipole: 5.2663 -1.5217 -0.3174
dipole: 5.4910
quadrupole: -65.8299 -56.3542 -50.9414
quadrupole: 1.1359 0.4269 0.3127
quadrupole: -8.1214 1.3543 6.7671 1.1359 0.4269 0.3127
hfenergy: -422.6352007 hartree
pointgroup: C01 [X(C7H10O2)]
dipole: 2.0878194 -0.5377217 -0.1371847 debye
dipolederiv: -0.6647385 0.166436 0.0062138 0.2563131 -0.6693603 0.0046215 0.0414709 -0.0161049 -0.2839808 -0.889863 -0.1031728 0.0362482 -0.1638833 -0.4882267 0.0154794 0.065587 0.0219523 -0.2934879 0.1352623 -0.022647 -0.0095841 -0.0271378 0.1009642 -0.0007396 0.018316 -0.0309338 0.1540214 -0.4639776 0.024653 0.0586952 -0.0417968 -0.0700183 0.0129449 0.1497021 -0.0225665 0.136409 -0.3945669 0.1470922 0.0335732 0.2680925 -0.2411696 -0.0427022 0.0752234 -0.0053098 0.1048568 0.9985206 -0.0906025 -0.0828031 -0.11408 0.5052468 -0.0144891 -0.1471744 0.0222295 0.1637639 0.9985685 -0.1295846 -0.0656295 -0.1575371 0.628147 -0.0017959 -0.0801581 -0.0144054 0.1684759 -0.0423202 0.0225701 0.0272669 0.0229821 0.0357058 -0.0064732 0.0156722 0.0053286 0.0900797 0.0460727 -0.0040579 -0.0254253 0.0560901 -0.0329955 -0.0131125 -0.0345097 0.0195601 0.0769485 0.0269608 0.0051078 0.0196001 -0.0049775 0.0359886 -0.0499201 -0.0194734 -0.0208682 -0.1599773 0.0712663 0.001476 0.0147554 -0.0023409 0.0788392 -0.0499631 -0.0255818 -0.0213071 -0.1095136 0.0503612 -0.0245949 0.0008247 -0.0446952 -0.0396921 0.0779009 -0.0147811 0.1067797 0.0496096 0.0789248 0.018846 0.0291305 -0.0084182 0.1055141 -0.029011 -0.0180787 -0.0698299 -0.0651861 0.0593989 0.0026937 -0.0523075 0.0102179 0.0857362 -0.0039089 0.0183022 -0.0329661 -0.1606116 -0.07003 -0.0944188 -0.0255656 -0.1572145 -0.0013279 -0.0439005 -0.0301363 -0.0445098 0.0743029 0.0582883 0.046854 -0.0026204 0.1088255 -0.1247416 0.078143 -0.018417 0.0894815 0.0543106 0.0869197 0.095013 -0.0399407 0.030564 -0.0765951 0.0523865 -0.0339565 0.0623773 0.0651757 0.0767247 -0.0179647 0.041167 -0.0300734 0.072796 0.0348331 -0.0029531 -0.029361 -0.1398465 -0.1617726 -0.0436985 0.0364013 -0.0009306 0.0951894 -0.0202931 0.040946 -0.0195466 0.0746496 unknown
polarizability: 89.015377|-0.707935|82.2278128|-1.4593744|0.3621954|55.859336 unknown
InChI: InChI=1S/C7H10O2/c1-4-3-6(8)7(9)5(4)2/h4-5H,3H2,1-2H3
charge 0 multiplicity 1
19 atoms
O  -1.574459 1.720821 -0.074322
O  -2.432724 -1.142587 0.119887
C  1.178338 -0.620796 0.327522
C  0.721168 0.751719 -0.266787
C  0.019667 -1.601637 -0.019715
C  -0.801961 0.738401 -0.109418
C  -1.248928 -0.75536 0.014702
C  2.554303 -1.089719 -0.17661
C  1.392259 2.008782 0.313245
H  1.219917 -0.509726 1.430781
H  0.912249 0.715826 -1.365688
H  -0.056642 -2.47586 0.648558
H  0.148323 -1.993846 -1.051516
H  2.552278 -1.196824 -1.278484
H  3.349986 -0.372396 0.094256
H  2.824925 -2.069532 0.257811
H  0.934215 2.92032 -0.108127
H  1.266635 2.047513 1.410639
H  2.47285 2.024302 0.087564
