program: Gaussian 09
title: 000061596
version: EM64L-G09RevD.01
frameworkgroup: C1[X(C15H32O4S)]
method: RPBEPBE
basis: SDD
operation: Freq
keyword: #p
keyword: freq=noraman
keyword: PBEPBE/SDD
title: #p freq=noraman PBEPBE/SDD
converged: YES YES NO NO
title: Mulliken charges:
elementType: S O O O O C C C C C C C C C C C C C C C H H H H H H H H H H H H H H H H H H H H H H H H H H H H H H H H
charge: 1.198438 -0.387825 -0.543004 -0.475608 -0.483779 -0.386900 -0.386365 -0.385936 -0.386245 -0.385032 -0.384525 -0.381903 -0.377883 -0.372810 -0.381170 -0.353238 -0.382485 -0.356648 -0.299348 -0.696580 0.194825 0.193729 0.194986 0.194309 0.193816 0.193765 0.194676 0.196066 0.193502 0.192818 0.196689 0.195213 0.191987 0.191852 0.197728 0.199775 0.189503 0.189202 0.199127 0.201478 0.187528 0.187643 0.222435 0.226474 0.194834 0.194617 0.235727 0.244691 0.209598 0.209690 0.215104 0.385460
chargesum: 0.00000
title: Mulliken charges with hydrogens summed into heavy atoms:
elementType: S O O O O C C C C C C C C C C C C C C C
charge: 1.198438 -0.387825 -0.157545 -0.475608 -0.483779 0.001655 0.002930 0.001644 0.004497 0.001288 0.007377 0.001936 0.019620 0.005894 0.019436 0.021932 0.066425 0.032802 0.181069 -0.062188
polarizability: 3.16523306e+02 2.89960179e+00 1.75336808e+02 2.16498110e+00 1.80579307e+00 1.67625901e+02
1716.lowfreq: -39.2008 -4.6699 -1.9408 -0.0019 0.0016 0.0021 9.8961 11.7317 16.8506
frequency: -25.9162 10.3583 11.6046 22.4232 32.9945 36.6542 41.7040 61.2099 65.5861 74.8251 88.3525 89.5562 103.2194 113.2597 116.5253 122.0455 133.6647 138.2190 154.5256 157.3874 167.1691 181.5324 205.1709 223.6417 227.7474 248.7835 284.0921 289.4257 309.9374 328.6260 357.7311 377.9396 414.4774 441.9910 461.6218 495.1101 503.9230 539.9438 592.0188 720.3473 721.5486 723.5028 728.8779 740.0288 757.7805 781.7695 812.2037 848.9254 862.7731 886.9974 887.7832 890.0856 931.9423 967.9143 971.3289 975.9248 980.7976 1000.5935 1008.2062 1013.1132 1031.9220 1036.2757 1046.1690 1058.0508 1069.4370 1076.3101 1079.2237 1082.3848 1082.8627 1090.6475 1104.2572 1123.7643 1150.6642 1179.9480 1193.0397 1198.8209 1213.2346 1221.5718 1233.9229 1244.4005 1253.3427 1265.3331 1268.4754 1275.9063 1278.8409 1284.2052 1286.0858 1286.5012 1292.2256 1294.0554 1299.7258 1300.2125 1306.0716 1323.9897 1338.5841 1346.9373 1350.1032 1352.7688 1355.8202 1356.4139 1357.6519 1387.3654 1458.5024 1459.3096 1461.1820 1461.5316 1463.8924 1464.1863 1465.5234 1468.3534 1472.2198 1476.1446 1476.5673 1479.9381 1483.5398 1487.0180 1488.2894 1489.9151 2948.5605 2948.7731 2949.8488 2950.3302 2951.4626 2952.6620 2955.2730 2958.0494 2960.9238 2964.4184 2967.6530 2968.5806 2971.1888 2981.3783 2983.3499 2986.4092 2990.5907 2994.4088 2995.8505 3001.9186 3003.7090 3008.9727 3016.9914 3025.2393 3032.9499 3039.4132 3044.0946 3056.3470 3067.5378 3070.1328 3082.9196 3473.0877
redmass: 1.8684 4.9331 4.9736 4.7649 2.0408 3.7311 4.3387 3.5144 1.6857 4.7462 1.8514 2.8360 5.5361 1.7601 2.9653 4.0737 1.8893 2.2364 1.9901 2.0776 3.7248 1.9175 4.3091 5.6957 1.1211 4.1413 2.3999 4.0716 4.9340 11.2781 3.6901 5.2200 3.9740 4.3209 3.3241 3.3907 2.9978 10.9910 12.5561 1.0619 1.0586 1.0712 1.0876 1.1071 1.1294 1.1553 1.1877 1.2198 15.7288 1.9545 5.3263 1.3363 1.2199 3.5064 1.4674 3.4962 3.7620 3.8461 1.3917 2.6217 3.5519 1.0783 3.2586 3.0201 2.6420 2.5627 2.1357 2.1800 2.2152 2.4813 1.8619 3.0456 1.3667 1.8974 1.5800 1.3012 1.4872 1.3049 1.3853 1.2988 1.3059 1.2902 1.1982 1.1047 1.0354 1.0669 1.2965 1.1187 1.0880 1.1140 1.1101 1.1127 1.3186 1.3598 1.4191 1.5464 1.5411 1.6873 1.4893 1.5653 1.5290 1.2169 1.0726 1.0738 1.0710 1.0723 1.0677 1.0652 1.0722 1.0838 1.0849 1.0762 1.0520 1.0879 1.0905 1.0916 1.0942 1.0978 1.0584 1.0584 1.0587 1.0588 1.0591 1.0592 1.0593 1.0591 1.0589 1.0586 1.0587 1.0583 1.0364 1.0959 1.0966 1.0977 1.0990 1.0563 1.1005 1.1019 1.0572 1.1034 1.1045 1.1050 1.1050 1.1048 1.1045 1.1059 1.1007 1.0992 1.1089 1.0662
irintensity: 0.8458 0.2776 0.2915 0.5453 0.1047 0.4829 0.4425 0.1452 0.4722 0.7492 0.1894 0.6579 0.4239 0.4322 1.0399 0.8583 0.2355 0.2157 0.0209 0.4108 11.5699 30.2097 10.4935 1.7517 0.0003 16.2568 56.7478 10.3207 3.1361 12.9231 1.7382 29.6920 4.0767 21.3164 1.0423 6.9636 0.2743 77.6656 170.9965 9.8966 19.9990 0.3406 0.0961 4.1967 0.1865 1.8696 0.0561 1.6722 136.3899 5.1743 16.8135 3.1495 0.0852 58.2358 1.7593 2.4356 2.4268 2.8070 0.4897 0.4648 4.4147 0.0607 8.9160 1.5934 1.0692 1.5368 0.8315 0.0388 0.9491 10.6122 62.9498 26.3743 1.3394 1.1962 8.0481 40.2178 0.2587 1.7319 0.1077 2.7706 0.0419 0.9725 0.0280 0.0783 0.3196 0.0035 0.8519 0.0955 0.1576 0.0678 0.0092 0.0395 0.6781 0.2418 1.1427 1.3757 1.2599 0.8369 1.4999 0.0924 1.3925 11.2279 0.0206 0.0570 0.0029 0.1195 1.8981 0.3929 3.6887 0.7208 3.8230 3.1087 9.5581 5.4385 0.7217 8.7260 10.6637 48.0447 0.0123 0.0641 0.0352 0.2163 0.1480 0.3715 2.0221 2.6261 1.0292 57.4197 87.5591 275.4062 39.2804 0.0799 0.0526 0.0563 0.0204 13.7836 0.0686 0.1899 41.9725 0.0407 0.9837 0.4950 12.4250 11.4806 350.8441 19.6818 99.1290 55.6191 60.4863 64.4149
temp: 298.150 k
press: 1.00000 atm
elementType: 16 8 8 8 8 6 6 6 6 6 6 6 6 6 6 6 6 6 6 6 1 1 1 1 1 1 1 1 1 1 1 1 1 1 1 1 1 1 1 1 1 1 1 1 1 1 1 1 1 1 1 1
symmnumber: 1
zpe: 1182353.7 jmol-1
zpe.correction: 0.450335 hartree
zpe.thermalcorrener: 0.477273 hartree
zpe.thermalcorrenthalpy: 0.478217 hartree
zpe.thermalcorrgfe: 0.386948 hartree
zpe.sumelectzpe: -1287.875189 hartree
zpe.sumelectthermal: -1287.848251 hartree
zpe.sumelectthermalent: -1287.847306 hartree
zpe.sumelectthermalfe: -1287.938575 hartree
dipole: -4.2440 0.2408 2.0280
dipole: 4.7098
quadrupole: -188.8401 -142.4706 -129.2456
quadrupole: 1.5728 19.9644 0.3131
quadrupole: -35.3214 11.0482 24.2732 1.5728 19.9644 0.3131
hfenergy: -1288.3255234 hartree
pointgroup: C01 [X(C15H32O4S1)]
dipole: -1.6607827 0.2810164 0.7722438 debye
polarizability: 316.5300686|3.4456726|175.7402188|-0.3852208|-0.2271369|167.2157279 unknown
InChI: InChI=1S/C15H32O4S/c1-2-3-4-5-6-7-8-9-10-11-12-13-14-15-19-20(16,17)18/h16H,2-15H2,1H3
charge 0 multiplicity 1
52 atoms
S  8.907689 -0.069402 -0.255633
O  7.237948 0.69622 -0.22976
O  9.092545 -0.524092 1.520868
O  8.875694 -1.477642 -1.015988
O  9.923137 1.118219 -0.608672
C  -2.880565 0.472155 -0.15236
C  -1.578244 -0.348453 -0.016352
C  -4.1588 -0.365486 0.076263
C  -0.298188 0.504293 -0.166307
C  -5.463304 0.439176 -0.119632
C  1.001621 -0.329024 -0.097221
C  -6.740119 -0.38626 0.156616
C  2.281561 0.533529 -0.17802
C  -8.045807 0.408287 -0.071203
C  3.577887 -0.307684 -0.144356
C  -9.322341 -0.410526 0.225544
C  4.850557 0.57548 -0.194507
C  -10.628195 0.380991 -0.014569
C  6.118978 -0.288738 -0.167783
C  -11.898451 -0.443414 0.287161
H  -2.91869 0.932636 -1.161886
H  -2.861726 1.313944 0.571576
H  -1.57402 -1.155352 -0.778951
H  -1.56548 -0.855324 0.97138
H  -4.139357 -0.788309 1.102731
H  -4.15777 -1.233659 -0.616101
H  -0.280753 1.278495 0.629179
H  -0.33169 1.051423 -1.131652
H  -5.497962 0.832177 -1.157472
H  -5.450802 1.326919 0.547365
H  1.004453 -1.070564 -0.923103
H  1.012562 -0.913755 0.846344
H  -6.715582 -0.758819 1.202294
H  -6.742194 -1.286911 -0.492894
H  2.289577 1.255618 0.664502
H  2.259986 1.138138 -1.108193
H  -8.076896 0.767428 -1.121438
H  -8.037925 1.317157 0.566782
H  3.589191 -0.927038 0.775941
H  3.579187 -1.012881 -1.000473
H  -9.328242 -1.324066 -0.405714
H  -9.29685 -0.7620 1.278533
H  4.861896 1.269115 0.666796
H  4.848253 1.189749 -1.11417
H  -10.653565 0.729911 -1.067288
H  -10.620991 1.294638 0.614675
H  6.19244 -0.873796 0.768468
H  6.170019 -0.965888 -1.039945
H  -11.911477 -0.779372 1.341416
H  -11.946284 -1.345625 -0.351725
H  -12.817041 0.145651 0.108981
H  9.387432 0.30213 2.005555
