program: Gaussian 09
title: 000061524
version: EM64L-G09RevD.01
frameworkgroup: C1[X(C12H20O2)]
method: RPBEPBE
basis: SDD
operation: Freq
keyword: #pfreq=noraman
keyword: PBEPBE/SDD
title: #p freq=noraman PBEPBE/SDD
converged: YES YES NO NO
title: Mulliken charges:
elementType: O O C C C C C C C C C C C C H H H H H H H H H H H H H H H H H H H H
charge: -0.250500 -0.229585 -0.371639 -0.372842 -0.374616 -0.352443 -0.374099 -0.356346 -0.500998 -0.696167 0.191747 -0.178279 0.167053 -0.501940 0.195269 0.186271 0.195700 0.187706 0.226099 0.187975 0.185864 0.188907 0.213935 0.204817 0.194155 0.197273 0.237949 0.244100 0.210231 0.208847 0.215516 0.242650 0.234510 0.242879
chargesum: 0.00000
title: Mulliken charges with hydrogens summed into heavy atoms:
elementType: O O C C C C C C C C C C C C
charge: -0.250500 -0.229585 0.009901 0.010565 0.039459 0.022328 0.044653 0.035082 -0.018949 -0.061573 0.191747 -0.178279 0.167053 0.218099
polarizability: 1.77409547e+02 1.91217736e+01 1.45763963e+02 2.70235049e+00 -3.30766650e+00 1.00006302e+02
1716.lowfreq: -10.6404 -0.0001 0.0003 0.0007 4.2060 5.0552 7.1319 19.1626 39.7730
frequency: 6.9988 19.0551 39.7104 48.6015 68.2012 83.9507 92.5677 103.9928 116.4862 121.3402 145.9134 172.3890 187.4971 222.4874 228.7466 255.0766 285.7414 319.2190 379.6002 401.3259 449.6862 460.5167 524.1647 580.5566 702.6165 721.3917 728.5100 740.2759 764.6894 813.1120 843.5392 874.1535 890.2448 919.2591 958.0908 998.5858 1008.5696 1031.8826 1042.7500 1065.1910 1080.0563 1082.9017 1108.9311 1110.6644 1117.5396 1145.9847 1186.4244 1197.1251 1225.2299 1228.9046 1240.3911 1267.2439 1279.9265 1281.2633 1292.4883 1294.9720 1314.4830 1322.7166 1346.0795 1355.4544 1361.0020 1389.4503 1420.8116 1444.2013 1451.6263 1460.8770 1461.5790 1462.0749 1464.6860 1469.5179 1476.7120 1476.9741 1483.7817 1488.5401 1600.0190 2267.0113 2950.4447 2951.1628 2957.2118 2962.7347 2968.5032 2969.8591 2971.6157 2980.9992 2986.0781 2994.7910 3002.9722 3009.6845 3018.6535 3023.9254 3036.8283 3052.1854 3068.1850 3070.8122 3103.7153 3149.5527
redmass: 6.2178 4.6915 1.6055 3.5322 3.8309 2.5888 2.5366 2.0169 1.2936 2.5224 1.9048 2.8206 3.3308 3.1926 1.1204 4.3017 4.2219 2.8986 4.3102 4.4925 3.3585 3.3104 4.9673 4.4965 11.7723 1.0629 1.2104 2.1768 1.4422 1.4487 1.7379 2.6661 1.8635 1.5754 2.7586 1.6001 2.2878 3.7047 3.0544 3.0601 2.1350 2.3799 1.2729 1.4910 2.3376 1.4549 1.6519 1.3122 2.7105 1.7318 1.2995 1.2759 1.2552 1.0342 1.1380 1.1078 1.3126 1.4347 1.4693 1.6671 1.5780 1.2175 1.1878 1.0866 1.0500 1.0746 1.0522 1.0746 1.0681 1.0776 1.0724 1.0481 1.0861 1.0912 10.2149 11.8748 1.0590 1.0589 1.0598 1.0606 1.0590 1.0594 1.0365 1.0624 1.0954 1.0983 1.0297 1.1005 1.0994 1.1018 1.1044 1.1043 1.1007 1.0993 1.1044 1.1045
irintensity: 1.7095 0.1680 0.0055 0.5075 0.4113 2.8797 1.5159 3.1777 0.4371 0.6334 0.2643 1.7618 0.2684 0.3206 0.0012 1.7703 13.0774 2.3719 3.5998 1.6962 0.1688 0.0358 5.3737 0.2038 16.5261 14.5421 2.2045 9.0747 4.4916 6.6680 3.2964 15.0707 3.4019 2.6326 3.5960 3.5912 14.2990 54.3085 66.3976 50.7290 4.9293 29.2425 0.0278 1.2124 10.7584 38.9991 0.7431 6.6177 250.9482 93.1083 1.7549 0.0632 0.1121 0.4891 1.2063 0.3638 3.3155 16.0134 2.6055 0.8334 8.9357 10.9651 29.1017 16.2807 14.1727 0.3360 10.6842 0.0365 0.6001 1.1258 3.9305 10.2699 3.1191 26.5774 213.7146 207.5877 0.5658 2.9355 6.7595 18.8991 109.3121 37.7688 34.7639 60.9949 6.3298 1.8989 35.0511 0.4684 11.7411 8.1062 55.2183 117.5690 98.9111 53.6444 27.2669 17.2378
temp: 298.150 k
press: 1.00000 atm
elementType: 8 8 6 6 6 6 6 6 6 6 6 6 6 6 1 1 1 1 1 1 1 1 1 1 1 1 1 1 1 1 1 1 1 1
symmnumber: 1
zpe: 767429.8 jmol-1
zpe.correction: 0.292299 hartree
zpe.thermalcorrener: 0.310254 hartree
zpe.thermalcorrenthalpy: 0.311198 hartree
zpe.thermalcorrgfe: 0.241621 hartree
zpe.sumelectzpe: -618.543871 hartree
zpe.sumelectthermal: -618.525916 hartree
zpe.sumelectthermalent: -618.524972 hartree
zpe.sumelectthermalfe: -618.594548 hartree
dipole: 0.1224 2.0450 -0.6993
dipole: 2.1647
quadrupole: -77.1608 -82.4698 -86.5450
quadrupole: 4.3250 0.8751 1.6540
quadrupole: 4.8977 -0.4112 -4.4865 4.3250 0.8751 1.6540
hfenergy: -618.8361693 hartree
pointgroup: C01 [X(C12H20O2)]
dipole: 0.0463349 -0.8086771 0.2631321 debye
polarizability: 177.0933088|-19.3026618|146.0830641|-3.907957|-2.4075543|100.0034388 unknown
InChI: InChI=1S/C12H20O2/c1-3-4-5-6-7-8-9-10-11-12(13)14-2/h3-9H2,1-2H3
charge 0 multiplicity 1
34 atoms
O  -4.972601 0.646933 0.384176
O  -3.254849 1.977964 -0.480542
C  2.400535 -0.995055 -0.32172
C  3.22652 0.121348 0.356947
C  0.994306 -1.168935 0.294342
C  4.640424 0.287533 -0.243927
C  0.16884 -2.273208 -0.400533
C  5.462625 1.410564 0.429174
C  -1.238556 -2.485571 0.228794
C  6.877499 1.56448 -0.169734
C  -2.116393 -1.30924 0.141213
C  -2.867511 -0.330629 0.067394
C  -3.657964 0.867235 -0.050804
C  -5.860906 1.832174 0.303002
H  2.301302 -0.768893 -1.403985
H  2.95551 -1.954498 -0.253382
H  2.677626 1.082473 0.275079
H  3.313304 -0.095281 1.442467
H  0.444529 -0.208567 0.234272
H  1.093211 -1.407954 1.374165
H  5.19281 -0.671719 -0.156118
H  4.55611 0.498923 -1.33062
H  0.053011 -2.030496 -1.474708
H  0.713443 -3.237075 -0.345474
H  5.540234 1.202853 1.516123
H  4.9134 2.369552 0.335037
H  -1.125777 -2.762849 1.297012
H  -1.744896 -3.341095 -0.261637
H  6.827003 1.802881 -1.249065
H  7.457898 0.628763 -0.060448
H  7.443281 2.373234 0.328549
H  -5.465734 2.650489 0.928489
H  -6.831471 1.478475 0.677747
H  -5.939261 2.181688 -0.740387
