program: Gaussian 09
title: 000061483
version: EM64L-G09RevD.01
frameworkgroup: C1[X(C6H9Cl3Si)]
method: RPBEPBE
basis: SDD
operation: Freq
keyword: #p
keyword: freq=noraman
keyword: PBEPBE/SDD
title: #p freq=noraman PBEPBE/SDD
converged: YES YES NO NO
title: Mulliken charges:
elementType: Cl Cl Cl Si C C C C C C H H H H H H H H H
charge: -0.239957 -0.240372 -0.239637 0.806431 -0.605351 -0.367706 -0.385032 -0.447002 -0.202891 -0.182172 0.307765 0.233740 0.225607 0.233752 0.232439 0.223973 0.220397 0.213759 0.212256
chargesum: 0.00000
title: Mulliken charges with hydrogens summed into heavy atoms:
elementType: Cl Cl Cl Si C C C C C C
charge: -0.239957 -0.240372 -0.239637 0.806431 -0.297586 0.091641 0.081159 -0.002631 0.010868 0.030084
polarizability: 1.22869906e+02 4.95601169e+00 1.17222826e+02 1.82809352e+00 -1.43324462e+00 9.27985710e+01
1716.lowfreq: -11.0047 -9.6723 -0.0032 -0.0029 -0.0029 8.4771 31.7351 67.0042 76.4758
frequency: 31.0167 66.9684 76.3617 125.9795 139.6349 150.3699 160.9407 199.0031 257.6797 279.5757 379.3321 408.1962 437.8230 488.3901 517.9273 522.7368 654.7270 686.0337 780.0623 848.4371 886.8688 912.1578 929.1503 960.0022 976.2097 1053.8014 1067.7250 1076.5696 1140.0889 1187.5977 1197.7503 1247.7649 1270.9521 1287.0482 1326.9840 1332.6753 1348.8936 1378.6085 1456.7169 1461.3722 1475.4662 1678.6262 2958.7547 2962.8437 2986.8977 2993.6809 3017.1539 3024.3039 3055.6108 3102.7503 3133.6991
redmass: 3.6093 6.9617 10.1544 4.8461 12.1986 8.0419 3.9972 2.7990 5.5896 15.6481 2.3365 2.1901 9.1141 4.8812 14.1842 15.1365 1.5821 2.3410 1.6781 4.2012 2.1134 1.9618 2.6170 2.0648 1.2770 2.2831 1.7191 2.6869 1.1523 1.1856 1.1529 1.2293 1.2333 1.2240 1.3434 1.4732 1.4646 1.5435 1.0918 1.0789 1.0863 6.4142 1.0649 1.0633 1.0739 1.0701 1.0935 1.0956 1.1039 1.0842 1.0996
irintensity: 0.0301 0.7407 0.5825 0.8435 2.5274 8.2532 4.6199 1.0921 0.3956 0.1889 1.5521 2.2443 67.1960 16.9906 129.7062 116.2138 44.0299 12.1138 14.4085 5.9953 10.6858 18.1031 1.7480 5.2279 0.2493 4.3478 4.8203 2.9207 7.3885 9.8030 6.0016 6.9801 2.0743 6.5279 0.8184 1.9393 8.6564 0.9751 3.3769 18.8043 12.5226 7.9719 14.2935 37.3619 6.5438 5.0657 29.5781 15.1231 23.9307 5.9194 53.5539
temp: 298.150 k
press: 1.00000 atm
elementType: 17 17 17 14 6 6 6 6 6 6 1 1 1 1 1 1 1 1 1
symmnumber: 1
zpe: 365458.7 jmol-1
zpe.correction: 0.139196 hartree
zpe.thermalcorrener: 0.151018 hartree
zpe.thermalcorrenthalpy: 0.151962 hartree
zpe.thermalcorrgfe: 0.099121 hartree
zpe.sumelectzpe: -1902.929862 hartree
zpe.sumelectthermal: -1902.918040 hartree
zpe.sumelectthermalent: -1902.917096 hartree
zpe.sumelectthermalfe: -1902.969937 hartree
dipole: 4.0282 0.1892 -0.5371
dipole: 4.0683
quadrupole: -90.1482 -88.9736 -92.7294
quadrupole: 1.1225 -0.6494 -0.2734
quadrupole: 0.4689 1.6435 -2.1123 1.1225 -0.6494 -0.2734
hfenergy: -1903.0690578 hartree
pointgroup: C01 [X(C6H9Cl3Si1)]
dipole: -1.5876226 0.0959851 0.1791218 debye
dipolederiv: -0.5297474 -0.1563264 -0.0701392 -0.2746405 -0.6561415 -0.1601859 -0.1099835 -0.1621886 -0.3790161 -0.5328234 0.160561 -0.0866477 0.2500025 -0.6356581 0.1847631 -0.1290401 0.1874386 -0.410919 -0.4330326 0.0057253 0.0666727 0.0000245 -0.3021858 -0.0208354 0.1744455 -0.0189778 -0.7856615 1.5631123 -0.0081769 0.1048643 0.039774 1.7144384 -0.004275 0.0897355 -0.0087746 1.7014155 0.039794 0.0115762 -0.040724 0.0109849 -0.3590884 0.0071574 -0.1164846 0.021307 -0.2503982 -0.1465958 0.0909879 -0.0130311 -0.1286889 0.0690463 0.0087294 0.1639767 -0.043386 0.1149142 -0.2364795 -0.0951628 -0.0126391 0.2127738 0.0641328 -0.0053903 0.1295586 0.0031833 0.1727777 0.0508799 -0.0162192 0.011365 0.0282071 -0.0364942 0.0114178 -0.0782735 -0.0092111 0.2045594 0.2518337 -0.0027915 -0.0238689 -0.0984301 -0.0304634 -0.0028417 -0.0719779 0.0117001 -0.222392 0.0359565 0.0841048 -0.0080696 0.0614726 0.1505459 0.0184275 -0.0022047 0.0310585 -0.2365127 0.0183933 0.0094029 0.077651 -0.0078147 0.0506718 -0.0171671 -0.0374465 -0.0132633 -0.0625794 0.0584684 0.0175584 0.023722 0.0280015 0.0754731 -0.0526692 0.0039587 0.0053081 -0.1079289 0.0417554 -0.1146735 -0.0117932 -0.088425 -0.0814693 -0.0159603 -0.0216279 -0.037177 0.0745578 0.0420215 0.0744127 -0.0395608 0.0188893 -0.0369685 0.0731816 -0.0543339 0.1013015 0.0310143 0.022054 0.0609182 0.0638165 -0.0152411 0.0830924 -0.0213422 0.0531311 -0.0738914 -0.0730093 -0.0581147 0.0681913 -0.0631001 0.0819043 -0.0414961 0.0731019 -0.0638443 0.1205484 0.0241718 0.068119 -0.0612009 0.001036 0.0040959 -0.0021846 -0.070467 0.0587301 -0.1142704 -0.1092276 -0.0764287 -0.0985185 -0.0027529 -0.1020303 -0.0789864 -0.0079482 -0.0102682 -0.0056662 0.1606252 -0.1791658 -0.0303691 0.0231991 -0.0208597 0.0537357 0.0023036 0.0219489 0.0049608 0.153609 unknown
polarizability: 122.6712369|-5.004934|117.3768804|2.5062392|0.8980822|92.8431857 unknown
InChI: InChI=1S/C6H9Cl3Si/c7-10(8,9)6-4-2-1-3-5-6/h1-2,6H,3-5H2
charge 0 multiplicity 1
19 atoms
Cl 2.691875 1.81188 0.855669
Cl 2.690992 -1.718743 1.003817
Cl 2.180006 -0.079576 -2.083096
Si 1.755958 0.010393 0.056586
C  -0.118727 0.025861 0.367754
C  -0.814112 1.23561 -0.317073
C  -0.780622 -1.313274 -0.061871
C  -2.293927 1.313694 0.132835
C  -2.296375 -1.216653 0.009091
C  -2.973073 -0.043418 0.113688
H  -0.226522 0.136884 1.467003
H  -0.766582 1.106983 -1.415796
H  -0.298983 2.18381 -0.072552
H  -0.429947 -2.136959 0.589909
H  -0.474509 -1.586257 -1.094586
H  -2.840082 2.013755 -0.529749
H  -2.359501 1.749504 1.151932
H  -2.848082 -2.165667 -0.023032
H  -4.068986 -0.056826 0.18557
