program: Gaussian 09
title: 000061466
version: EM64L-G09RevD.01
frameworkgroup: C1[X(C11H20O2)]
method: RPBEPBE
basis: SDD
operation: Freq
keyword: #pfreq=noraman
keyword: PBEPBE/SDD
title: #p freq=noraman PBEPBE/SDD
converged: YES YES NO NO
title: Mulliken charges:
elementType: O O C C C C C C C C C C C H H H H H H H H H H H H H H H H H H H H
charge: -0.268213 -0.239412 0.047048 -0.450111 -0.450032 -0.403062 -0.401777 -0.382588 -0.433745 -0.531031 0.234786 -0.225555 -0.673362 0.181065 0.189525 0.203392 0.199046 0.192155 0.196825 0.189773 0.190965 0.196812 0.198320 0.188155 0.213891 0.217858 0.242453 0.254808 0.226851 0.226116 0.210647 0.229270 0.229128
chargesum: 0.00000
title: Mulliken charges with hydrogens summed into heavy atoms:
elementType: O O C C C C C C C C C C C
charge: -0.268213 -0.239412 0.228113 -0.057195 -0.058831 -0.016464 -0.014000 0.003887 -0.001997 -0.033770 0.234786 0.227412 -0.004317
polarizability: 1.57178477e+02 2.61247150e+00 1.14935750e+02 -9.54697175e-02 2.05563553e+00 9.75593027e+01
1716.lowfreq: -24.1624 -10.6204 -0.0005 -0.0004 -0.0001 7.9202 10.8350 37.5069 55.4029
frequency: -11.9768 36.2355 55.3294 61.5748 79.0782 132.0640 145.9254 185.7930 197.2980 227.1047 252.3077 283.7477 318.1167 354.7382 410.1814 430.2450 439.5999 471.4441 541.1857 546.8196 678.1499 751.5257 783.5205 787.6435 799.1156 815.4494 842.2660 868.8127 888.5369 906.3789 919.1308 960.4500 980.7731 1022.2494 1047.3938 1055.9997 1057.3053 1082.7727 1093.7292 1112.4215 1114.4225 1125.5469 1130.4928 1136.1285 1168.4069 1190.0604 1240.3797 1249.7179 1255.9731 1258.5721 1269.7450 1281.0412 1306.7217 1313.6060 1335.3427 1337.8065 1341.5510 1342.2911 1354.7428 1359.8184 1368.2935 1399.9938 1438.5147 1459.7528 1462.9139 1463.6895 1465.8729 1468.1888 1470.9559 1474.2794 1478.4911 1487.2037 1640.3292 2928.6597 2953.3801 2959.0039 2963.2730 2964.5207 2965.5405 2981.9576 2990.1257 2994.9515 3007.8998 3015.9063 3019.8457 3025.6149 3026.9375 3028.5831 3039.6238 3053.3900 3065.7783 3091.5656 3106.3911
redmass: 3.8345 3.3626 2.7746 3.7218 2.2203 2.5167 2.2561 2.7329 5.0896 1.7908 1.2462 4.0668 1.7972 3.3943 2.1279 3.1900 2.8548 2.5704 1.9006 2.6073 4.6689 1.6687 1.6257 1.7502 1.0993 3.4973 1.9785 1.8880 1.8752 1.9942 2.9488 2.2277 1.6527 2.3292 2.1003 1.6203 1.4371 1.6685 2.1770 2.2593 2.4993 2.6450 1.7351 1.4689 1.7046 1.5404 1.3359 1.1344 1.2270 1.2904 1.2750 1.1998 1.3697 1.2408 1.3655 1.5025 1.4418 1.5457 1.3779 1.5106 1.6511 1.2685 1.0858 1.0895 1.0883 1.0403 1.0892 1.0872 1.0826 1.0589 1.0954 1.0695 9.6298 1.0810 1.0617 1.0614 1.0624 1.0610 1.0665 1.0612 1.0601 1.0358 1.0581 1.0964 1.0997 1.0949 1.1017 1.0982 1.1035 1.1011 1.1066 1.0985 1.1025
irintensity: 0.5731 0.0615 0.2803 0.6151 0.0403 1.9595 6.7487 1.7826 2.1848 0.1615 1.2856 7.3847 1.1622 6.2372 0.6768 0.7630 1.1687 4.2186 3.6628 1.2317 2.0069 6.3109 2.1985 1.2965 3.6224 4.6613 4.2971 2.7722 16.9636 2.7692 17.2998 17.1781 0.9652 40.9675 13.5888 16.5133 23.5164 36.7198 8.0370 22.7888 0.2137 198.2382 82.6080 6.3843 17.5447 8.9338 13.9545 0.0589 3.7883 6.8153 50.0792 1.6230 27.7469 6.9234 0.1516 2.8060 5.2070 2.1405 1.4332 2.1903 17.1872 18.1633 21.1312 0.9439 4.0321 11.9353 7.6771 9.7854 27.7054 5.0006 3.6932 13.3388 165.8181 12.6520 25.2496 62.5484 27.7381 27.2956 32.7097 13.5050 17.6823 23.9772 21.3289 96.0064 29.3105 62.5120 19.8669 5.2974 127.3404 55.9813 10.7746 31.7736 46.3801
temp: 298.150 k
press: 1.00000 atm
elementType: 8 8 6 6 6 6 6 6 6 6 6 6 6 1 1 1 1 1 1 1 1 1 1 1 1 1 1 1 1 1 1 1 1
symmnumber: 1
zpe: 765587.3 jmol-1
zpe.correction: 0.291597 hartree
zpe.thermalcorrener: 0.305322 hartree
zpe.thermalcorrenthalpy: 0.306267 hartree
zpe.thermalcorrgfe: 0.250200 hartree
zpe.sumelectzpe: -580.573226 hartree
zpe.sumelectthermal: -580.559500 hartree
zpe.sumelectthermalent: -580.558556 hartree
zpe.sumelectthermalfe: -580.614622 hartree
dipole: 0.3278 1.6301 0.6544
dipole: 1.7869
quadrupole: -69.7421 -86.5023 -79.9134
quadrupole: 3.6473 1.1837 -2.4826
quadrupole: 8.9772 -7.7831 -1.1941 3.6473 1.1837 -2.4826
hfenergy: -580.8648225 hartree
pointgroup: C01[X(C11H20O2)]
dipole: -0.1269229 0.638557 -0.2652907 debye
polarizability: 157.1701837|-2.6663531|114.8945575|0.1821173|-2.263907|97.6087888 unknown
InChI: InChI=1S/C11H20O2/c1-2-13-11(12)9-8-10-6-4-3-5-7-10/h10H,2-9H2,1H3
charge 0 multiplicity 1
33 atoms
O  -3.275927 0.460317 -0.186913
O  -2.436953 -1.567544 0.595374
C  1.67389 -0.156028 -0.290549
C  2.074656 1.11043 0.512384
C  2.770702 -1.244508 -0.14576
C  3.475211 1.635875 0.113461
C  4.170774 -0.725525 -0.548369
C  4.554139 0.536807 0.25926
C  0.296468 -0.724183 0.131465
C  -0.888117 0.210008 -0.183095
C  -2.235548 -0.423284 0.126964
C  -4.661728 -0.041533 0.069378
C  -5.618069 1.064481 -0.364813
H  1.621437 0.126857 -1.366929
H  2.072989 0.857388 1.594478
H  1.324414 1.913323 0.371157
H  2.500866 -2.128795 -0.75718
H  2.797092 -1.585585 0.911302
H  3.739028 2.517589 0.729808
H  3.448534 1.980348 -0.941616
H  4.172118 -0.479094 -1.630808
H  4.928065 -1.520173 -0.400897
H  5.539612 0.920314 -0.069878
H  4.655345 0.26605 1.330973
H  0.30674 -0.952472 1.215739
H  0.127914 -1.692301 -0.379216
H  -0.886463 0.501905 -1.252205
H  -0.824263 1.158054 0.383993
H  -4.805189 -0.975983 -0.503037
H  -4.750888 -0.28226 1.144372
H  -6.662674 0.745521 -0.194699
H  -5.438822 1.98894 0.210377
H  -5.494753 1.293259 -1.437222
