program: Gaussian 09
title: 000061455
version: EM64L-G09RevD.01
frameworkgroup: C1[X(C11H22O2)]
method: RPBEPBE
basis: SDD
operation: Freq
keyword: #pfreq=noraman
keyword: PBEPBE/SDD
title: #p freq=noraman PBEPBE/SDD
converged: YES YES NO NO
title: Mulliken charges:
elementType: O O C C C C C C C C C C C H H H H H H H H H H H H H H H H H H H H H H
charge: -0.263557 -0.246606 -0.364795 -0.348434 -0.389720 -0.052933 -0.354731 -0.283988 -0.507747 -0.693059 -0.693735 0.259427 -0.694172 0.190636 0.191154 0.189794 0.189863 0.211230 0.209178 0.208407 0.195509 0.195776 0.223826 0.224907 0.234712 0.222986 0.245731 0.204169 0.209350 0.218776 0.219439 0.211431 0.216743 0.210235 0.210199
chargesum: 0.00000
title: Mulliken charges with hydrogens summed into heavy atoms:
elementType: O O C C C C C C C C C C C
charge: -0.263557 -0.246606 0.016994 0.031223 0.030687 0.155474 0.036555 0.164745 -0.050049 -0.033809 -0.044089 0.259427 -0.056995
polarizability: 1.63700789e+02 -1.92716466e+00 1.12736100e+02 -6.85093826e-01 3.53553301e+00 1.06313285e+02
1716.lowfreq: -5.8614 -2.1669 -0.0007 -0.0007 -0.0003 12.3360 22.5604 33.2713 42.0166
frequency: 21.6000 33.1884 41.6434 45.0177 67.9358 80.8548 102.6909 132.9442 137.6371 158.3211 200.5988 203.8328 215.7700 230.9706 232.4141 271.7863 330.6011 356.7620 407.8769 420.8698 456.8967 488.4193 584.9816 725.6534 732.7703 745.3959 785.9190 795.8270 835.5695 882.9238 888.0937 900.7937 921.8007 937.5076 964.5528 968.8327 986.7086 1010.8663 1049.8067 1062.8680 1072.1536 1085.3245 1103.7770 1126.6556 1148.9740 1168.8574 1189.6116 1196.0101 1237.4952 1242.9947 1245.8884 1269.1107 1274.7894 1290.2410 1293.4942 1293.7345 1327.8897 1338.9165 1349.4465 1356.4880 1374.0988 1382.8992 1389.2583 1400.2305 1451.8404 1463.5300 1464.3006 1465.4578 1469.9846 1470.7523 1477.0757 1477.2810 1481.7297 1484.8992 1486.5038 1489.7092 1630.5082 2954.3962 2959.2202 2969.0005 2970.9785 2972.6576 2974.1959 2979.3941 2988.7940 2991.4227 2999.1381 3008.0536 3013.3453 3030.4332 3044.4211 3068.1821 3069.1510 3069.2493 3071.9913 3073.2408 3076.7195 3083.9190 3085.6503
redmass: 3.6851 2.5415 2.2208 3.2456 3.3928 2.4938 1.9035 2.9655 2.2217 2.9751 1.6104 2.0165 1.8456 1.2393 1.3206 3.7535 2.9365 2.1660 2.2620 3.2772 2.9503 2.8705 4.7871 1.0664 4.5105 1.0939 3.3295 1.1709 4.6131 1.2026 1.9551 1.6906 1.4788 2.1125 1.7468 2.3535 1.1483 3.8517 3.0718 2.1846 2.4847 2.0730 1.4963 2.7896 1.4722 2.5388 2.1935 1.5198 1.2829 1.2927 1.2728 1.5233 1.1140 1.0958 1.1190 1.2858 1.5182 1.3768 1.4078 1.6274 1.5632 1.2134 1.2171 1.2174 1.1007 1.0728 1.0429 1.0723 1.0743 1.0610 1.0723 1.0438 1.0472 1.0778 1.0548 1.0939 9.6976 1.0587 1.0590 1.0590 1.0778 1.0365 1.0370 1.0392 1.0598 1.0978 1.0566 1.1015 1.0607 1.1037 1.1044 1.0995 1.1011 1.1002 1.0993 1.1072 1.0998 1.1021 1.0997
irintensity: 0.0233 0.2965 0.8766 0.6840 0.0382 0.2489 0.2073 0.1499 0.1334 1.3720 1.3184 3.1647 3.8306 0.4147 0.8806 5.9711 1.3294 0.5721 0.7553 7.5196 2.2045 0.6184 4.6453 11.8296 5.9989 0.1361 0.8054 1.4147 12.2384 1.2058 11.3588 5.7636 4.3271 22.7939 8.7965 25.7741 0.1148 0.5117 23.1610 170.4588 0.2830 1.4740 2.8251 3.4142 5.6922 186.5016 45.2357 0.3785 1.8257 8.9940 30.5225 64.9404 1.2443 0.1909 1.4164 2.4880 1.1347 3.6008 13.4300 1.3847 0.2051 23.0910 11.5080 16.4149 7.4835 0.0429 2.0091 0.1400 0.7549 6.3661 0.3771 12.2758 22.6428 5.0225 13.7653 27.4865 171.5848 0.0216 8.7503 88.3754 24.2651 35.5983 32.5118 27.1135 17.8813 0.4521 43.7845 0.5588 21.4808 29.7511 21.9497 40.7405 61.4525 5.4991 52.6024 122.9193 44.7728 28.1100 41.0694
temp: 298.150 k
press: 1.00000 atm
elementType: 8 8 6 6 6 6 6 6 6 6 6 6 6 1 1 1 1 1 1 1 1 1 1 1 1 1 1 1 1 1 1 1 1 1 1
symmnumber: 1
zpe: 815524.0 jmol-1
zpe.correction: 0.310617 hartree
zpe.thermalcorrener: 0.327727 hartree
zpe.thermalcorrenthalpy: 0.328672 hartree
zpe.thermalcorrgfe: 0.263251 hartree
zpe.sumelectzpe: -581.744178 hartree
zpe.sumelectthermal: -581.727067 hartree
zpe.sumelectthermalent: -581.726123 hartree
zpe.sumelectthermalfe: -581.791543 hartree
dipole: -1.0712 1.4785 0.8797
dipole: 2.0266
quadrupole: -77.5048 -86.2297 -82.4029
quadrupole: 6.4440 4.4708 -3.3061
quadrupole: 4.5410 -4.1839 -0.3571 6.4440 4.4708 -3.3061
hfenergy: -582.0547944 hartree
pointgroup: C01 [X(C11H22O2)]
dipole: -0.4221655 -0.566608 -0.3694449 debye
polarizability: 163.7009244|1.3155867|112.4843172|1.6016065|3.7327488|106.5649321 unknown
InChI: InChI=1S/C11H22O2/c1-4-5-6-7-8-13-11(12)9-10(2)3/h10H,4-9H2,1-3H3
charge 0 multiplicity 1
35 atoms
O  0.883005 0.22077 -0.618585
O  2.220657 1.630051 0.665891
C  -2.842213 0.441052 0.246703
C  -4.073383 -0.365612 -0.224288
C  -1.525921 -0.040152 -0.40809
C  4.082082 -0.906216 -0.143352
C  -5.397054 0.11634 0.412013
C  -0.31886 0.752317 0.093448
C  3.258073 0.114972 -0.997974
C  4.879471 -0.213921 0.986045
C  3.18761 -2.040893 0.40881
C  2.118063 0.753525 -0.226187
C  -6.621291 -0.699948 -0.055768
H  -2.75823 0.366369 1.351019
H  -3.00002 1.515716 0.017954
H  -4.154504 -0.301604 -1.329459
H  -3.922286 -1.439038 0.014668
H  -1.595355 0.05952 -1.50849
H  -1.368677 -1.114685 -0.192084
H  4.809527 -1.3574 -0.850034
H  -5.31273 0.058536 1.516529
H  -5.55002 1.187483 0.167809
H  -0.404855 1.832899 -0.127758
H  -0.164049 0.638483 1.182584
H  2.844933 -0.395706 -1.884371
H  3.933951 0.923294 -1.333679
H  4.203921 0.295304 1.695825
H  5.477282 -0.956868 1.546196
H  5.571586 0.547536 0.581061
H  2.479603 -1.655504 1.166621
H  2.595228 -2.517221 -0.393773
H  3.805351 -2.81963 0.892502
H  -7.554011 -0.335632 0.412684
H  -6.746379 -0.634076 -1.153135
H  -6.507906 -1.769363 0.204467
