program: Gaussian 09
title: 000061420
version: EM64L-G09RevD.01
frameworkgroup: C1[X(C2H4N2O4)]
method: RPBEPBE
basis: SDD
operation: Freq
keyword: #pfreq=noraman
keyword: PBEPBE/SDD
title: #p freq=noraman PBEPBE/SDD
converged: YES YES NO NO
title: Mulliken charges:
elementType: O O O O N N C C H H H H
charge: -0.176426 -0.194163 -0.193941 -0.176384 0.153552 0.153897 -0.350576 -0.350688 0.268656 0.298842 0.298622 0.268610
chargesum: 0.00000
title: Mulliken charges with hydrogens summed into heavy atoms:
elementType: O O O O N N C C
charge: -0.176426 -0.194163 -0.193941 -0.176384 0.153552 0.153897 0.216922 0.216543
polarizability: 6.09491194e+01 1.35674854e+01 5.06046258e+01 4.59331755e-01 2.75003508e-01 4.23059612e+01
1716.lowfreq: 0.0005 0.0007 0.0009 0.2234 8.8041 10.6970 24.1734 43.1923 55.8142
frequency: 24.0322 43.1795 55.7470 265.6752 301.8154 381.9283 507.7505 511.2826 564.6208 608.5588 612.1166 790.8696 798.1306 945.0099 971.1981 1090.1005 1201.0823 1220.0738 1229.8468 1260.5910 1310.6336 1333.5300 1411.1555 1414.4630 1447.5738 1449.7028 3045.5699 3052.8175 3121.4226 3128.9452
redmass: 8.0998 14.6663 7.0315 2.4382 3.6011 9.1878 3.7872 3.1274 4.8933 4.1777 7.0716 7.1264 7.2732 2.4460 2.0717 2.5578 1.3644 3.6562 3.7089 1.4272 1.4414 1.9844 1.5441 1.1006 2.4186 4.3644 1.0598 1.0628 1.1040 1.1022
irintensity: 3.6512 0.2012 5.7880 4.1187 11.0937 2.5636 2.9085 1.1460 24.0816 1.6460 3.9050 24.4160 27.4496 5.5113 5.6509 0.0434 29.0434 62.4560 53.4076 8.9799 40.2654 0.0494 246.9612 15.3879 110.6276 13.5021 5.3545 1.2573 0.0248 1.0762
temp: 298.150 k
press: 1.00000 atm
elementType: 8 8 8 8 7 7 6 6 1 1 1 1
symmnumber: 1
zpe: 203959.8 jmol-1
zpe.correction: 0.077684 hartree
zpe.thermalcorrener: 0.085593 hartree
zpe.thermalcorrenthalpy: 0.086537 hartree
zpe.thermalcorrgfe: 0.042683 hartree
zpe.sumelectzpe: -488.204038 hartree
zpe.sumelectthermal: -488.196129 hartree
zpe.sumelectthermalent: -488.195185 hartree
zpe.sumelectthermalfe: -488.239039 hartree
dipole: -0.0011 -0.1990 5.1091
dipole: 5.1130
quadrupole: -59.2659 -47.5337 -42.0450
quadrupole: -0.3100 -0.0005 -0.2007
quadrupole: -9.6510 2.0811 7.5699 -0.3100 -0.0005 -0.2007
hfenergy: -488.2817218 hartree
pointgroup: C01 [X(C2H4N2O4)]
dipole: -0.0194181 -2.0101985 0.0722399 debye
dipolederiv: -0.578746 0.0530722 -0.3054632 0.1772715 -0.3360153 -0.0102484 -0.2013111 -0.1191822 -0.5614985 -0.4286781 -0.1257558 -0.0435256 -0.0649886 -0.3727283 0.2425773 -0.2104272 0.1342012 -0.6748019 -0.4262608 0.1216936 -0.0596862 0.0476816 -0.4065658 -0.2626798 -0.219006 -0.151108 -0.6424185 -0.5804922 -0.0721144 -0.300303 -0.1872481 -0.3223678 -0.0029118 -0.1849824 0.1041878 -0.5726765 0.8170024 -0.2898435 0.3558835 -0.3533525 0.6003287 0.3261342 0.3818373 0.3179501 0.9763667 0.8258679 0.3131165 0.3248596 0.3783049 0.5405482 -0.2976354 0.3464911 -0.2899761 1.0279188 0.104912 0.0394072 0.0006746 0.1190707 0.0025351 -0.0706102 0.0446406 -0.086901 0.0383965 0.1026719 -0.0417515 0.0048942 -0.1184718 0.0172834 0.0716237 0.0526296 0.0868008 0.0266697 -0.0175123 -0.057638 -0.0064789 -0.0202673 0.0210248 0.0084885 -0.009102 0.0223225 0.135095 0.1003257 0.0523078 0.0187622 0.057291 0.1207401 0.064958 0.0024784 0.0089739 0.0526727 0.0968874 -0.050278 0.0207765 -0.0560684 0.1172275 -0.0697391 0.0069935 -0.0133251 0.0578519 -0.0159778 0.0577839 -0.0103936 0.020777 0.0179893 0.000043 -0.0102418 -0.0139438 0.1364241 unknown
polarizability: 54.0857955|0.4632241|42.3115704|14.4188093|0.4733317|57.4623406 unknown
InChI: InChI=1S/C2H4N2O4/c5-3(6)1-2-4(7)8/h1-2H2
charge 0 multiplicity 1
12 atoms
O  -2.494419 0.651268 -1.175507
O  1.543053 1.139162 -0.894401
O  -1.515014 1.236909 0.802184
O  2.501685 0.690243 1.128745
N  -1.600096 0.52898 -0.266024
N  1.609388 0.514884 0.226029
C  -0.567543 -0.588609 -0.491306
C  0.555091 -0.563445 0.529767
H  -1.135944 -1.532354 -0.428972
H  -0.206318 -0.451559 -1.522145
H  0.198136 -0.346979 1.54831
H  1.10498 -1.5202 0.533822
