program: Gaussian 09
title: 000061416
version: EM64L-G09RevD.01
frameworkgroup: C1[X(C15H28O2)]
method: RPBEPBE
basis: SDD
operation: Freq
keyword: #pfreq=noraman
keyword: PBEPBE/SDD
title: #p freq=noraman PBEPBE/SDD
converged: YES YES NO NO
title: Mulliken charges:
elementType: O O C C C C C C C C C C C C C C C H H H H H H H H H H H H H H H H H H H H H H H H H H H H
charge: -0.263570 -0.259323 0.049287 -0.420133 -0.451732 -0.467884 -0.757028 -0.355207 -0.303148 -0.513284 -0.349622 0.377776 0.277121 -0.340554 -0.802273 -0.805594 -0.692001 0.228100 0.194001 0.191389 0.202959 0.257616 0.206504 0.200469 0.202554 0.213897 0.226759 0.226085 0.233733 0.212566 0.240931 0.244432 0.212214 0.206059 0.194511 0.190383 0.220600 0.224941 0.216166 0.257389 0.211373 0.221076 0.211643 0.216367 0.212448
chargesum: 0.00000
title: Mulliken charges with hydrogens summed into heavy atoms:
elementType: O O C C C C C C C C C C C C C C C
charge: -0.263570 -0.259323 0.277388 -0.034742 0.008843 -0.060911 -0.113819 0.104612 -0.090581 -0.027921 0.068652 0.377776 0.277121 0.044341 -0.140566 -0.115755 -0.051543
polarizability: 2.04845076e+02 1.47593055e+01 1.53827956e+02 5.50471053e+00 2.59783822e+00 1.46158911e+02
1716.lowfreq: -34.8503 -15.9123 -8.8833 -6.8270 -0.0006 -0.0003 0.0007 11.9089 22.3051
frequency: -33.6705 10.7463 21.7836 38.2567 46.8111 66.8622 71.8317 83.9538 102.6521 109.0208 132.2386 139.5254 165.6229 172.3056 188.9471 207.6650 228.2052 234.6348 270.0965 283.4472 292.4607 300.0720 336.2123 364.9512 377.3640 405.7752 440.8234 458.3698 487.2290 515.4735 537.2123 562.2050 661.9363 722.2347 730.9072 772.6755 777.2425 789.3028 822.1091 857.2046 873.2030 878.8976 903.8618 918.3934 922.2222 946.5757 955.6022 974.3505 996.7134 999.5014 1028.4645 1037.9388 1042.6388 1080.8764 1083.9266 1093.0574 1097.9336 1106.2686 1114.1383 1122.8132 1140.8154 1152.7679 1170.3937 1204.9998 1210.9934 1226.9805 1236.9335 1257.2983 1260.1244 1273.0320 1286.3661 1297.0268 1308.3386 1331.0579 1333.6393 1347.2355 1357.6829 1359.5001 1362.0543 1366.9870 1385.9092 1388.2001 1390.8804 1403.3924 1441.0340 1451.4713 1454.3840 1455.9694 1459.4716 1463.9876 1464.8511 1468.8933 1473.4160 1475.8368 1476.6510 1477.7189 1478.1106 1486.2097 1486.7273 1633.6281 1690.8478 2947.3202 2951.9519 2959.6761 2962.1990 2964.5674 2964.9423 2967.8368 2974.7838 2977.6676 2987.3937 2989.4270 3003.5870 3009.8779 3021.4050 3027.4241 3035.5385 3035.9332 3041.6859 3052.7874 3058.8389 3060.2855 3061.1384 3070.5474 3072.3112 3074.2552 3074.6413 3087.8035 3105.7183
redmass: 1.5428 3.7196 3.6582 3.5334 5.2016 3.6173 3.4188 2.6927 3.6537 2.1444 1.1397 2.1473 2.0317 1.6653 2.0419 1.7529 1.6688 1.1072 3.3159 2.4271 2.7860 2.6838 2.6839 2.5147 2.1948 2.1259 2.3948 2.7983 2.3972 2.7989 2.9749 2.9147 4.4709 1.1185 2.0477 2.3673 2.4215 1.3055 1.6867 2.2079 1.8874 1.8511 1.7836 1.3474 1.9151 1.4523 1.5621 2.3339 1.7744 1.2468 2.6913 1.9803 2.3084 2.0730 1.6549 1.7729 2.3094 1.8194 1.9715 2.3529 2.8714 2.0603 1.6057 1.4475 1.4232 1.8236 1.2041 1.3695 1.3896 1.1971 1.0680 1.2648 1.2971 1.4696 1.2604 1.4580 1.5505 1.5242 1.4973 1.4448 1.2182 1.2615 1.2199 1.2281 1.0874 1.0822 1.0511 1.0970 1.0834 1.0620 1.0689 1.0733 1.0701 1.0703 1.0663 1.0535 1.0436 1.0498 1.0764 8.8202 6.4828 1.0623 1.0374 1.0595 1.0619 1.0420 1.0610 1.0425 1.0370 1.0637 1.0831 1.0603 1.0992 1.0976 1.0960 1.0601 1.0970 1.0970 1.0910 1.0944 1.1001 1.0938 1.0955 1.0987 1.1006 1.0989 1.0978 1.0962 1.1055
irintensity: 0.3461 0.2480 0.0881 0.0849 1.0510 1.0666 2.6091 0.0526 1.6906 0.1510 0.2041 2.1856 1.4887 1.6217 2.5986 1.5634 2.4439 0.1018 3.3926 0.4358 1.5068 3.1132 7.5246 4.2605 1.5687 0.8261 4.8091 2.0541 1.2057 4.4528 1.5322 6.1759 4.4349 16.4076 3.7525 7.7016 2.2848 0.2348 14.4100 0.9265 7.2964 9.6308 11.0121 5.2862 18.4418 5.1119 4.4302 7.2113 3.3429 4.3454 1.2529 2.9174 33.8093 3.7694 4.5945 15.8867 77.7775 1.8113 2.9560 8.3415 191.7003 2.6557 5.6656 1.9905 1.3720 2.4633 8.7014 46.3862 2.9980 3.5145 0.4308 0.9655 1.2342 26.2972 0.8294 3.5143 2.9000 4.6404 2.7612 7.2447 20.1056 16.3724 15.4031 16.1117 26.1732 5.3461 2.3644 24.9174 9.0633 1.2415 0.7287 7.7455 17.7982 2.7492 11.0278 27.2032 5.4231 8.0289 20.0858 130.3848 4.1345 19.2070 48.5232 29.4071 65.1000 43.7005 15.3195 49.2355 35.6453 0.9473 14.3720 38.5287 10.7932 34.1259 39.5140 42.1852 3.1327 29.7575 11.8224 12.4476 21.3144 9.0713 82.6873 39.3390 102.8181 23.7711 75.9651 34.8253 23.1286
temp: 298.150 k
press: 1.00000 atm
elementType: 8 8 6 6 6 6 6 6 6 6 6 6 6 6 6 6 6 1 1 1 1 1 1 1 1 1 1 1 1 1 1 1 1 1 1 1 1 1 1 1 1 1 1 1 1
symmnumber: 1
zpe: 1046117.0 jmol-1
zpe.correction: 0.398445 hartree
zpe.thermalcorrener: 0.419620 hartree
zpe.thermalcorrenthalpy: 0.420564 hartree
zpe.thermalcorrgfe: 0.345893 hartree
zpe.sumelectzpe: -737.446209 hartree
zpe.sumelectthermal: -737.425034 hartree
zpe.sumelectthermalent: -737.424090 hartree
zpe.sumelectthermalfe: -737.498761 hartree
dipole: -0.4127 -0.2404 -1.2588
dipole: 1.3464
quadrupole: -100.5549 -106.5619 -110.6305
quadrupole: 2.3501 -4.2987 -0.4018
quadrupole: 5.3609 -0.6462 -4.7147 2.3501 -4.2987 -0.4018
hfenergy: -737.8446538 hartree
pointgroup: C01 [X(C15H28O2)]
dipole: -0.1513314 0.1216834 0.4928235 debye
polarizability: 201.4429829|-19.5793269|157.3518375|-4.8725917|2.9022597|146.0371224 unknown
InChI: InChI=1S/C15H28O2/c1-5-6-10-15(16)17-12-11-14(4)9-7-8-13(2)3/h8,14H,5-7,9-12H2,1-4H3
charge 0 multiplicity 1
45 atoms
O  0.037316 2.149527 0.040386
O  0.953801 0.925187 -1.722228
C  -2.648439 0.878769 0.577453
C  -3.580114 -0.359709 0.477596
C  -2.176746 1.351124 -0.822761
C  -2.961478 -1.621785 -0.188997
C  -3.35661 2.010595 1.359486
C  -1.147242 2.492513 -0.810169
C  -1.706146 -2.11155 0.5085
C  2.066916 0.957672 0.492505
C  3.347284 0.372409 -0.135821
C  -0.514507 -2.471956 -0.052491
C  1.002477 1.317285 -0.531927
C  4.34065 -0.141212 0.930206
C  0.640578 -2.950459 0.815523
C  -0.2123 -2.439645 -1.54124
C  5.633789 -0.712706 0.310365
H  -1.74591 0.577793 1.146856
H  -4.502148 -0.079606 -0.074828
H  -3.903414 -0.628501 1.504943
H  -3.053787 1.70427 -1.406734
H  -1.737906 0.505177 -1.380907
H  -2.768193 -1.430193 -1.25955
H  -3.731339 -2.422704 -0.157866
H  -4.239261 2.383619 0.803186
H  -3.709689 1.646402 2.342436
H  -2.683949 2.866405 1.548352
H  -1.535587 3.411322 -0.343625
H  -0.790741 2.706833 -1.83373
H  -1.794681 -2.187089 1.605431
H  1.61141 0.219385 1.184941
H  2.284336 1.851151 1.106308
H  3.072137 -0.450746 -0.822946
H  3.837982 1.142427 -0.762878
H  4.59667 0.683478 1.626535
H  3.846152 -0.923311 1.543289
H  0.919735 -3.993658 0.565492
H  0.392746 -2.911184 1.891015
H  1.548576 -2.336289 0.644353
H  0.549176 -1.668101 -1.771747
H  0.200699 -3.412933 -1.872331
H  -1.099511 -2.223855 -2.158545
H  6.1618 0.056675 -0.283676
H  6.329598 -1.075293 1.088983
H  5.408968 -1.55983 -0.364444
